{"text_format":"1","workbook":"xlsx","n_sheets":15,"sheets":["Details","Risk Assessment","Re-Feeding Risk","BP XY","BP XX","Growth XX","Growth XY","BMI XX","BMI XY","LMSDataMale","LMSDataFemale","Daily Sheets","Daily Sheets Extend","Meal Support","Investigations"],"not_rendered":{"charts":10,"images":33,"macros":1,"external_links":3,"defined_names":51,"comments":0,"pivot_tables":0},"unopened":[],"bounds":{"document_bytes":16777216,"sheet_cells":100000,"rows_first":2000,"rows_last":500,"rows_between":2000,"halvings":0,"cell_chars":16384,"cell_head_chars":4096},"cells_cut":0,"cells_raw":0,"read":"whole","date_system":"1900"}

{"sheet":"Details","index":0,"n_rows":46,"n_cols":21,"rows_kept":46,"cut":false,"hidden":false,"merged":[[9,1,9,4],[29,5,30,5],[25,1,25,2],[0,6,0,13],[11,14,14,17],[1,6,3,9],[4,6,6,9],[1,10,3,13],[4,10,6,13],[5,1,5,4],[7,1,7,4],[0,1,0,4],[1,1,1,4],[2,1,2,4],[3,1,3,4],[4,1,4,4],[27,0,27,4],[28,0,28,4],[29,0,29,4],[30,0,30,4],[18,1,18,3],[19,1,19,3],[20,1,20,3],[40,0,40,4],[43,1,43,4],[41,0,41,4],[34,0,34,4],[31,0,31,4],[32,1,32,4],[33,1,33,4],[42,1,42,4]]}
["Patient","Select Sex First",null,null,null,null,null,null,null,null,null,null,null,null,null,null,null,null,1,null,"Anderson"]
["First Name",null,null,null,null,null,null,null,null,null,null,null,null,null,null,null,null,"Yes",2,"inch","Baird"]
["Surname",null,null,null,null,null,null,null,null,null,null,null,null,null,null,null,null,"No",3,"cm","Farnon"]
["Unit No",null,null,null,null,null,null,null,null,null,null,null,null,null,null,null,null,null,4,null,"Gandon"]
["NHS No.",null,null,null,null,null,null,null,null,null,null,null,null,null,null,null,null,null,5,"Male","Gray"]
["Date of Birth",null,null,null,null,null,null,null,null,null,null,null,null,null,null,null,null,null,6,"Female","Kithany"]
[null,null,null,null,null,null,null,null,null,null,null,null,null,null,null,null,null,null,7,null,"Pedley"]
["Birth Sex",null,null,null,null,null,null,null,null,null,null,null,null,null,null,null,null,null,8,null,"Pettit"]
[null,null,null,null,null,null,null,null,null,null,null,null,null,null,null,null,null,null,9,null,"Ridley"]
["Admission Date",{"$f":"NOW()","v":"2022-05-19T13:10:07.600"},null,null,null,null,"Age Lookup","Next Age","Interpolation","Height L","Height M","Height S","Weight L","Weight M","Weight S","BMI L","BMI M","BMI S",10,null,"Staples"]
["Age",{"$f":"IF(B6>0,INT(ROUND(F11,2)),0)","v":0},"Years",{"$f":"IF(B6>0,(F11-B11)*12,0)","v":0},"Months",{"$f":"IF(B10=0,,(B10-B6)/365.2422)","v":122.38604602390981},{"$f":"IF(B8=\"Male\",VLOOKUP((F11),LMSDataMale!A7:M315,1),VLOOKUP((F11),LMSDataFemale!A7:M315,1))","v":23},{"$f":"IF(B8=\"Male\",VLOOKUP((F11+0.084),LMSDataMale!A7:M315,1),VLOOKUP((F11+0.084),LMSDataFemale!A7:M315,1))","v":23},{"$f":"(F11-G11)/(H11-G11)","v":{"$error":"#DIV/0!"}},{"$f":"IF(B8=\"Male\",VLOOKUP(F11,LMSDataMale!A7:M315,2)+I11*((VLOOKUP(H11,LMSDataMale!A7:M315,2))-(VLOOKUP(F11,LMSDataMale!A7:M315,2))),VLOOKUP(F11,LMSDataFemale!A7:M315,2)+I11*((VLOOKUP(H11,LMSDataFemale!A7:M315,2))-(VLOOKUP(F11,LMSDataFemale!A7:M315,2))))","v":{"$error":"#DIV/0!"}},{"$f":"IF(B8=\"Male\",VLOOKUP(F11,LMSDataMale!A7:M315,3)+I11*((VLOOKUP(H11,LMSDataMale!A7:M315,3))-(VLOOKUP(F11,LMSDataMale!A7:M315,3))),VLOOKUP(F11,LMSDataFemale!A7:M315,3)+I11*((VLOOKUP(H11,LMSDataFemale!A7:M315,3))-(VLOOKUP(F11,LMSDataFemale!A7:M315,3))))","v":{"$error":"#DIV/0!"}},{"$f":"IF(B8=\"Male\",VLOOKUP(F11,LMSDataMale!A7:M315,4)+I11*((VLOOKUP(H11,LMSDataMale!A7:M315,4))-(VLOOKUP(F11,LMSDataMale!A7:M315,4))),VLOOKUP(F11,LMSDataFemale!A7:M315,4)+I11*((VLOOKUP(H11,LMSDataFemale!A7:M315,4))-(VLOOKUP(F11,LMSDataFemale!A7:M315,4))))","v":{"$error":"#DIV/0!"}},{"$f":"IF(B8=\"Male\",VLOOKUP(F11,LMSDataMale!A7:M315,5)+I11*((VLOOKUP(H11,LMSDataMale!A7:M315,5))-(VLOOKUP(F11,LMSDataMale!A7:M315,5))),VLOOKUP(F11,LMSDataFemale!A7:M315,5)+I11*((VLOOKUP(H11,LMSDataFemale!A7:M315,5))-(VLOOKUP(F11,LMSDataFemale!A7:M315,5))))","v":{"$error":"#DIV/0!"}},{"$f":"IF(B8=\"Male\",VLOOKUP(F11,LMSDataMale!A7:M315,6)+I11*((VLOOKUP(H11,LMSDataMale!A7:M315,6))-(VLOOKUP(F11,LMSDataMale!A7:M315,6))),VLOOKUP(F11,LMSDataFemale!A7:M315,6)+I11*((VLOOKUP(H11,LMSDataFemale!A7:M315,6))-(VLOOKUP(F11,LMSDataFemale!A7:M315,6))))","v":{"$error":"#DIV/0!"}},{"$f":"IF(B8=\"Male\",VLOOKUP(F11,LMSDataMale!A7:M315,7)+I11*((VLOOKUP(H11,LMSDataMale!A7:M315,7))-(VLOOKUP(F11,LMSDataMale!A7:M315,7))),VLOOKUP(F11,LMSDataFemale!A7:M315,7)+I11*((VLOOKUP(H11,LMSDataFemale!A7:M315,7))-(VLOOKUP(F11,LMSDataFemale!A7:M315,7))))","v":{"$error":"#DIV/0!"}},{"$f":"IF(B8=\"Male\",VLOOKUP(F11,LMSDataMale!A7:M315,8)+I11*((VLOOKUP(H11,LMSDataMale!A7:M315,8))-(VLOOKUP(F11,LMSDataMale!A7:M315,8))),VLOOKUP(F11,LMSDataFemale!A7:M315,8)+I11*((VLOOKUP(H11,LMSDataFemale!A7:M315,8))-(VLOOKUP(F11,LMSDataFemale!A7:M315,8))))","v":{"$error":"#DIV/0!"}},{"$f":"IF(B8=\"Male\",VLOOKUP(F11,LMSDataMale!A7:M315,9)+I11*((VLOOKUP(H11,LMSDataMale!A7:M315,9))-(VLOOKUP(F11,LMSDataMale!A7:M315,9))),VLOOKUP(F11,LMSDataFemale!A7:M315,9)+I11*((VLOOKUP(H11,LMSDataFemale!A7:M315,9))-(VLOOKUP(F11,LMSDataFemale!A7:M315,9))))","v":{"$error":"#DIV/0!"}},{"$f":"IF(B8=\"Male\",VLOOKUP(F11,LMSDataMale!A7:M315,10)+I11*((VLOOKUP(H11,LMSDataMale!A7:M315,10))-(VLOOKUP(F11,LMSDataMale!A7:M315,10))),VLOOKUP(F11,LMSDataFemale!A7:M315,10)+I11*((VLOOKUP(H11,LMSDataFemale!A7:M315,10))-(VLOOKUP(F11,LMSDataFemale!A7:M315,10))))","v":{"$error":"#DIV/0!"}},11,null,"Taylor"]
["Weight",null,"kg",{"$f":"IF(B12=0,,100*NORMSDIST((POWER((B12/N11),M11)-1)/(M11*O11)))","v":0},{"$f":"IF(D12=0,\"\",\"%\")","v":""},null,null,null,null,null,null,null,null,null,null,null,null,null,12]
["Height",null,"cm",{"$f":"IF(B13=0,,100*NORMSDIST(((B13/K11)-1)/L11))","v":0},{"$f":"IF(D13=0,\"\",\"%\")","v":""},null,null,null,null,null,null,null,null,null,null,null,null,null,13]
["BMI",{"$f":"ROUND(IF(B13=0,0,B12/((B13/100)*(B13/100))),2)","v":0},"kg/m2",{"$f":"IF(B14=0,,100*NORMSDIST((POWER(B14/Q11,P11)-1)/(P11*R11)))","v":0},"",null,null,null,null,null,null,null,null,null,null,null,null,null,14]
["%BMI",{"$f":"ROUND(IF(B14=0,,(B12/(B13*B13)*1000000/Q11)),1)","v":0},"% of 50th Percentile BMI",null,null,null,null,null,null,null,null,null,null,null,null,null,null,null,15]
[null,null,null,null,null,null,null,null,null,null,null,null,null,null,null,null,null,null,16]
["BP","Systolic",null,"Diastolic",null,null,null,null,null,null,null,null,null,null,null,null,null,null,17]
[null,null,null,null,null,null,null,null,null,null,null,null,null,null,null,null,null,null,18]
["Risk Assessment","High Risk",null,null,{"$f":"'Risk Assessment'!C3","v":"0 of 16"},null,null,null,null,null,null,null,null,null,null,null,null,null,19]
[null,"Alert to High Concern",null,null,{"$f":"'Risk Assessment'!E3","v":"0 of 13"},null,null,null,null,null,null,null,null,null,null,null,null,null,20]
[null,"Low Risk",null,null,{"$f":"'Risk Assessment'!G3","v":"0 of 11"},null,null,null,null,null,null,null,null,null,null,null,null,null,21]
[null,null,null,null,null,null,null,null,null,null,null,null,null,null,null,null,null,null,22]
["Re-Feeding Risk",{"$f":"'Re-Feeding Risk'!B23","v":0},{"$f":"IF(B23>1,\"Risk Factors\",\"Risk Factor\")","v":"Risk Factor"},null,null,null,null,null,null,null,null,null,null,null,null,null,null,null,23]
["Re-Feed Bloods?","Yes",null,null,null,null,null,null,null,null,null,null,null,null,null,null,null,null,24]
["Stay Duration",7,"Days",null,null,null,null,null,null,null,null,null,null,null,null,null,null,null,25]
["Consultant Decision",null,null,null,null,null,null,null,null,null,null,null,null,null,null,null,null,null,26]
[null,null,null,null,null,null,null,null,null,null,null,null,null,null,null,null,null,null,27]
["   1. Complete Ward  Admission Pack",null,null,null,null,null,null,null,null,null,null,null,null,null,null,null,null,null,28]
["   2. Complete this page"]
["   3. Complete Risk Assessment Tab"]
["   4. Complete Re-Feeding Risk Tab"]
["   5. Consultant to decide- "]
["n","Refeeding Risk"]
["n","Duration of Admission"]
["   6. Click print to printout"]
[]
[]
[]
[]
["   Extend Admission"]
["   1. Complete Patient Details above"]
["   2. Complete Re-Feeding Risk Tab"]
["Admission Date",{"$f":"B10","v":"2022-05-19T13:10:07.600"}]
["Start of extension",{"$f":"NOW()","v":"2022-05-19T13:10:07.600"}]
["Day of Admission",{"$f":"INT(B44-B43)+1","v":1}," Day of Admission = Day 0"]
["Extend by",7,"Days"]

{"sheet":"Risk Assessment","index":1,"n_rows":35,"n_cols":11,"rows_kept":35,"cut":false,"hidden":false,"merged":[[1,0,1,1],[27,0,28,0],[27,2,28,2],[27,4,28,4],[27,6,28,6],[6,0,9,0],[6,2,9,2],[6,4,9,4],[6,6,9,6],[10,0,11,0],[10,2,11,2],[10,4,11,4],[10,6,11,6],[7,3,9,3],[7,1,9,1],[1,4,1,5],[30,0,31,0],[30,2,31,2],[30,4,31,4],[30,6,31,6],[16,0,18,0],[16,2,18,2],[16,4,18,4],[16,6,18,6],[19,0,26,0],[19,2,26,2],[19,4,26,4],[19,6,26,6],[16,5,18,5],[6,9,9,9],[6,10,9,10],[10,8,11,8],[10,9,11,9],[10,10,11,10],[30,9,31,9],[30,10,31,10],[16,8,18,8],[16,9,18,9],[16,10,18,10],[19,8,26,8],[27,8,28,8],[19,9,26,9],[19,10,26,10],[27,9,28,9],[27,10,28,10],[2,2,3,2],[2,4,3,4],[2,6,3,6],[30,8,31,8],[6,8,9,8]]}
["Risk Assessment"]
[{"$f":"Details!B2&\" \"&Details!B3","v":" "},null,null,{"$f":"\"Date of Birth   \"","v":"Date of Birth   "},{"$f":"Details!B6","v":"00:00:00"}]
[null,"Red",{"$f":"I4&\" of 16\"","v":"0 of 16"},"Amber",{"$f":"J4& \" of 13\"","v":"0 of 13"},"Green",{"$f":"K4&\" of 11\"","v":"0 of 11"},null,"Red","Amber","Green"]
[null,"High Risk",null,"Alert to High Concern",null,"Low Risk",null,"Clear",{"$f":"COUNTIF(I5:I35,TRUE)","v":0},{"$f":"COUNTIF(J5:J35,TRUE)","v":0},0]
["BMI","%BMI <70",null,"%BMI 70–80%",null,"%BMI>80%",null,null,{"$f":"IF(Details!B15<70,IF(Details!B15=0,FALSE,TRUE),FALSE)","v":false},{"$f":"IF(AND(Details!B15>=70,Details!B15<=80),TRUE,FALSE)","v":false},false]
["Weight Loss","Recent loss of weight of 1 kg or more/week for 2 consecutive weeks in an undernourished patient",null,"Recent loss of weight of 500– 999 g/week for 2 consecutive weeks in an undernourished patient",null,"Recent weight loss of < 500 g/week or fluctuating weight",null,null,false,false,false]
["Heart Rate","40 bpm",null,"40–50 bpm",null,">50 bpm",null,null,false,false,false]
[null,"Standing BP below 0.4th centile for age or less than 90 if 18+, associated with recurrent syncope and postural drop in BP of >20 mm Hg or increase in HR of over 30 bpm (35 bpm in <16 years)",null,"Standing BP <0.4th centile or <90 if 18+ associated with occasional syncope; postural drop in BP of >15 mm Hg or increase in HR of up to 30 bpm (35 bpm in <16 years)",null,"Normal standing BP for age and gender with reference to centile charts"]
[null,null,null,null,null,"Normal orthostatic cardiovascular changes"]
[null,null,null,null,null,"Normal heart rhythm"]
["Hydration status","Fluid refusal",null,"Severe fluid restriction",null,"Minimal Fluid Restriction",null,null,false,false,false]
[null,"Severe dehydration (10%): reduced urine output, dry mouth, postural BP drop (see above), decreased skin turgor, sunken eyes, tachypnoea, tachycardia",null,"Moderate dehydration (5–10%): reduced urine output, dry mouth, postural BP drop (see above), normal skin turgor, some tachypnoea, some tachycardia, peripheral oedema",null,"No more than mild dehydration (<5%): may have dry mouth or concerns about risk of dehydration with negative fluid balance"]
["Temperature","<35.5°C tympanic or 35.0°C axillary",null,"<36°C",null,">36°C",null,null,false,false,false]
["Muscular weakness – SUSS Test, Part 1: Sit up from lying flat","Unable to sit up at all from lying flat or Unable to sit up without using upper limbs (score 0 or 1)",null,"Unable to sit up without noticeable difficulty (score 2)",null,"Sits up from lying flat without any difficulty (score 3)",null,null,false,false,false]
["Muscular weakness – SUSS Test, Part 2: Stand up from squat","Unable to get up at all from squatting or Unable to get up without using upper limbs (score 0 or 1)",null,"Unable to get up without noticeable difficulty (score 2)",null,"Stands up from squat without any difficulty (score 3)",null,null,false,false,false]
["Other clinical state","Life-threatening medical condition, e.g. acute confusion, diabetic ketoacidosis",null,"Non-life-threatening physical compromise, e.g. haematemesis, pressure sores",null,"Evidence of physical compromise, e.g. poor cognitive flexibility, poor concentration",null,null,false,false,false]
["ECG abnormalities","QTc>460 ms (girls) or 400 ms (boys)",null,"QTc>460 ms (girls) or 400 ms (boys)",null,"QTc<460 ms (girls) or 400 ms (boys)",null,null,false,false,false]
[null,"and any other significant ECG abnormality",null,"No other ECG abnmaly"]
[null,null,null,"Taking medication known to prolong QTc interval"]
["Biocemical abnormalities","Hypophosphatamia",null,null,null,null,null,null,false]
[null,"Hypokalaemia (<2.5 mmol/L)"]
[null,"Hypoalbuminaemia"]
[null,"Hypoglycaemia (<3 mmol/L)"]
[null,"Hyponatraemia"]
[null,"Hypocalcaemia"]
[null,"Transaminases >3x normal range"]
[null,"In patients with diabetes mellitus: HbA1c>86 mmol/mol"]
["Haematology","Low white cell count",null,null,null,null,null,null,false]
[null,"Haemoglobin <100 g/L"]
["Disordered eating behaviours","Acute food refusal or estimated calorie intake <500 kcal per day for 2 or more days",null,null,null,null,null,null,false]
["Engagement with management plan","Physical struggles with staff or parents/carers over nutrition or reduction of exercise.",null,"Poor insight or motivation. Resistance to weight gain. Staff or parents/carers unable to implement meal plan prescribed",null,"Some insight and motivation to tackle eating problems. May be ambivalent but not actively resisting",null,null,false,false,false]
[null,"Harm to self"]
["Activity and exercise","High levels of uncontrolled exercise in the context of malnutrition (>2 h/day)",null,"Moderate levels of uncontrolled exercise in the context of malnutrition (>1 h/day)",null,"Mild levels or no uncontrolled exercise in the context of malnutrition (<1 h/day)",null,null,false,false,false]
["Purging behaviours","Multiple daily episodes of vomiting and/or laxative abuse",null,"Regular (=>3x per week) vomiting and/or laxative abuse",null,null,null,null,false,false]
["Self-harm and suicide","Self-poisoning, suicidal ideas with moderate to high risk of completed suicide",null,"Cutting or similar behaviours, suicidal ideas with low risk of completed suicide",null,null,null,null,false,false]

{"sheet":"Re-Feeding Risk","index":2,"n_rows":23,"n_cols":5,"rows_kept":23,"cut":false,"hidden":false,"merged":[[4,0,4,3],[9,0,9,3],[1,0,1,3],[2,1,2,3],[3,0,3,3]]}
["Re-feeding Risk"]
[{"$f":"Details!B2&\" \"&Details!B3","v":" "}]
[{"$f":"\"Date of Birth   \"","v":"Date of Birth   "},{"$f":"Details!B6","v":"00:00:00"}]
["Assessment of risk of re-feeding syndrome "]
["Refeeding syndrome can be defined as the potentially fatal shifts in fluids and electrolytes that may occur in malnourished patients on refeeding following a period of starvation. This is particularly common in adult patients receiving artificial refeeding, but is possible with oral refeeding (particularly if oral nutritional supplements are prescribed). The adult patient should be considered at risk of refeeding syndrome if they meet the following criteria.",null,null,null,"Yes"]
[null,null,null,null,"No"]
[null,null,null,null,"--"]
[]
[]
["In children there are no universally accepted criteria, but the there is increasing concern if there is acute on chronic weight loss. "]
[]
[]
["Clinical Feature","select",null,"High Risk Level"]
["Extremely low weight",{"$f":"IF('Risk Assessment'!I5=TRUE,\"Yes\",\"No\")","v":"No"},null,"%BMI <70%"]
["Prolonged low intake","--",null,"Little or no intake for >4 days"]
["Weight loss","--",null,"> 15% in the past 3 months"]
["Deranged baseline electrolytes",{"$f":"IF('Risk Assessment'!I20=TRUE,\"Yes\",\"--\")","v":"--"},null,"Low potassium, phosphorus, magnesium"]
["Low white blood cell count",{"$f":"IF('Risk Assessment'!I28=TRUE,\"Yes\",\"--\")","v":"--"},null,"total <3.8"]
["At risk for low thiamine","--",null,"Low thiamine and other vitamins (inc history of alcohol misuse or drugs, including insulin, chemotherapy, antacids, or diuretics)"]
["Medical complications","--",null,"Infection, cardiac, liver other serious disease"]
[]
[]
[null,{"$f":"COUNTIF(B14:B20,\"Yes\")","v":0}]

{"sheet":"BP XY","index":3,"n_rows":1,"n_cols":28,"rows_kept":1,"cut":false,"hidden":true,"merged":[[0,15,0,21]]}
[null,{"$f":"Details!B2&\" \"&Details!B3","v":" "},null,null,null,null,null,null,null,null,null,null,null,null,{"$f":"\"Date of Birth \"","v":"Date of Birth "},{"$f":"Details!B6","v":"00:00:00"},null,null,null,null,null,null,null,null,null,null,null,{"$f":"\"No. \"&Details!B4","v":"No. "}]

{"sheet":"BP XX","index":4,"n_rows":1,"n_cols":28,"rows_kept":1,"cut":false,"hidden":true,"merged":[[0,15,0,21]]}
[null,{"$f":"Details!B2&\" \"&Details!B3","v":" "},null,null,null,null,null,null,null,null,null,null,null,null,{"$f":"\"Date of Birth \"","v":"Date of Birth "},{"$f":"Details!B6","v":"00:00:00"},null,null,null,null,null,null,null,null,null,null,null,{"$f":"\"No. \"&Details!B4","v":"No. "}]

{"sheet":"Growth XX","index":5,"n_rows":1,"n_cols":28,"rows_kept":1,"cut":false,"hidden":true,"merged":[[0,15,0,21]]}
[null,{"$f":"Details!B2&\" \"&Details!B3","v":" "},null,null,null,null,null,null,null,null,null,null,null,null,{"$f":"\"Date of Birth \"","v":"Date of Birth "},{"$f":"Details!B6","v":"00:00:00"},null,null,null,null,null,null,null,null,null,null,null,{"$f":"\"No. \"&Details!B4","v":"No. "}]

{"sheet":"Growth XY","index":6,"n_rows":1,"n_cols":28,"rows_kept":1,"cut":false,"hidden":true,"merged":[[0,15,0,21]]}
[null,{"$f":"Details!B2&\" \"&Details!B3","v":" "},null,null,null,null,null,null,null,null,null,null,null,null,{"$f":"\"Date of Birth \"","v":"Date of Birth "},{"$f":"Details!B6","v":"00:00:00"},null,null,null,null,null,null,null,null,null,null,null,{"$f":"\"No. \"&Details!B4","v":"No. "}]

{"sheet":"BMI XX","index":7,"n_rows":1,"n_cols":28,"rows_kept":1,"cut":false,"hidden":true,"merged":[[0,15,0,21]]}
[null,{"$f":"Details!B2&\" \"&Details!B3","v":" "},null,null,null,null,null,null,null,null,null,null,null,null,{"$f":"\"Date of Birth \"","v":"Date of Birth "},{"$f":"Details!B6","v":"00:00:00"},null,null,null,null,null,null,null,null,null,null,null,{"$f":"\"No. \"&Details!B4","v":"No. "}]

{"sheet":"BMI XY","index":8,"n_rows":1,"n_cols":28,"rows_kept":1,"cut":false,"hidden":true,"merged":[[0,15,0,21]]}
[null,{"$f":"Details!B2&\" \"&Details!B3","v":" "},null,null,null,null,null,null,null,null,null,null,null,null,{"$f":"\"Date of Birth \"","v":"Date of Birth "},{"$f":"Details!B6","v":"00:00:00"},null,null,null,null,null,null,null,null,null,null,null,{"$f":"\"No. \"&Details!B4","v":"No. "}]

{"sheet":"LMSDataMale","index":9,"n_rows":315,"n_cols":13,"rows_kept":315,"cut":false,"hidden":true,"merged":[]}
["Male"]
[]
[]
[null,"Height (HT, cm)",null,null,"Weight (WT, kg)",null,null,"BMI (BMI, kg/m2)",null,null,"Head Circumference (cm)"]
["Age (yrs)"]
[null,"L","M","S","L","M","S","L","M","S","L","M","S"]
[-0.32580424366872007,null,null,null,1.147,0.61450000000000005,0.15875,null,null,null,1,21.632670000000001,4.4657460000000003E-2]
[-0.30663928815879532,null,null,null,1.1259999999999999,0.71420000000000006,0.16249,null,null,null,1,22.664660000000001,4.660628E-2]
[-0.28747433264887062,1,35.424140000000001,8.1324530000000006E-2,1.1040000000000001,0.81670000000000009,0.16628000000000001,null,null,null,1,23.69877,4.8520649999999999E-2]
[-0.26830937713894593,1,36.42492,7.8620040000000002E-2,1.083,0.9244,0.17007,null,null,null,1,24.733899999999998,5.0329029999999997E-2]
[-0.24914442162902123,1,37.427720000000001,7.5907249999999996E-2,1.0609999999999999,1.0364,0.17355000000000001,null,null,null,1,25.758299999999998,5.1834610000000003E-2]
[-0.2299794661190965,1,38.427889999999998,7.3144319999999999E-2,1.04,1.1577,0.17663000000000001,null,null,null,1,26.73601,5.2778360000000003E-2]
[-0.21081451060917181,1,39.436729999999997,7.0259660000000002E-2,1.018,1.2898000000000001,0.17904999999999999,null,null,null,1,27.63749,5.3023889999999997E-2]
[-0.19164955509924708,1,40.480080000000001,6.7222379999999998E-2,0.997,1.4359999999999999,0.18056,null,null,null,1,28.480129999999999,5.2590970000000001E-2]
[-0.17248459958932238,1,41.578380000000003,6.4044069999999995E-2,0.97499999999999998,1.605,0.18092,null,null,null,1,29.283850000000001,5.1560450000000001E-2]
[-0.15331964407939766,1,42.716630000000002,6.0801969999999997E-2,0.95399999999999996,1.7992999999999999,0.17979999999999999,null,null,null,1,30.050909999999998,5.0014749999999997E-2]
[-0.13415468856947296,1,43.870820000000002,5.7588830000000001E-2,0.93200000000000005,2.0156000000000001,0.17702999999999999,null,null,null,1,30.78144,4.8107810000000001E-2]
[-0.11498973305954825,1,45.018039999999999,5.4492909999999999E-2,0.91100000000000003,2.2471999999999999,0.17262,null,null,null,1,31.473710000000001,4.5989679999999998E-2]
[-9.5824777549623541E-2,1,46.141500000000001,5.1588759999999997E-2,0.88900000000000001,2.4860000000000002,0.16667999999999999,null,null,null,1,32.129240000000003,4.3768769999999999E-2]
[-7.665982203969883E-2,1,47.233520000000006,4.8952929999999999E-2,0.86799999999999999,2.7256999999999998,0.15937999999999999,null,null,null,1,32.751170000000002,4.1523379999999999E-2]
[-5.7494866529774126E-2,1,48.286769999999997,4.6641700000000001E-2,0.84599999999999997,2.9594,0.15117,null,null,null,1,33.342149999999997,3.9309179999999999E-2]
[-3.8329911019849415E-2,1,49.276600000000002,4.469878E-2,0.82499999999999996,3.1778000000000004,0.14258000000000001,null,null,null,1,33.899090000000001,3.7179039999999997E-2]
[-1.9164955509924708E-2,1,50.165950000000002,4.3150590000000003E-2,0.80300000000000005,3.3769,0.13469,null,null,null,1,34.418230000000001,3.5173129999999997E-2]
[0,1,50.944540000000003,4.1976279999999998E-2,0.78200000000000003,3.5550999999999999,0.12851000000000001,null,null,null,1,34.910710000000002,3.3278799999999997E-2]
[3.8329911019849415E-2,1,51,4.5100000000000001E-2,1,3.5,0.14269999999999999,null,null,null,1,35,3.8199999999999998E-2]
[3.8329911019849415E-2,1,52.3461,3.6519999999999997E-2,0.2581,3.7528999999999999,0.14141999999999999,0.41770000000000002,13.637700000000001,9.4539999999999999E-2,1,35.864899999999999,3.2579999999999998E-2]
[5.7494866529774126E-2,1,53.390500000000003,3.6089999999999997E-2,0.2442,4.0602999999999998,0.13807,0.34489999999999998,14.2241,9.2299999999999993E-2,1,36.521599999999999,3.1969999999999998E-2]
[7.665982203969883E-2,1,54.388100000000001,3.5700000000000003E-2,0.2331,4.3670999999999998,0.13497000000000001,0.28810000000000002,14.7714,9.0719999999999995E-2,1,37.092599999999997,3.1480000000000001E-2]
[8.3333333333333329E-2,1,54.724400000000003,3.5569999999999997E-2,0.22969999999999999,4.4709000000000003,0.13395000000000001,0.27079999999999999,14.944100000000001,9.0270000000000003E-2,1,37.2759,3.1329999999999997E-2]
[9.5824777549623541E-2,1,55.337400000000002,3.5340000000000003E-2,0.22370000000000001,4.6589999999999998,0.13214999999999999,0.2409,15.2355,8.9529999999999998E-2,1,37.600999999999999,3.107E-2]
[0.11498973305954825,1,56.235700000000001,3.5009999999999999E-2,0.2155,4.9302999999999999,0.12959999999999999,0.20030000000000001,15.6107,8.8590000000000002E-2,1,38.060899999999997,3.0720000000000001E-2]
[0.13415468856947296,1,57.085099999999997,3.4700000000000002E-2,0.20810000000000001,5.1817000000000002,0.12728999999999999,0.16450000000000001,15.9169,8.7819999999999995E-2,1,38.482399999999998,3.041E-2]
[0.15331964407939766,1,57.8889,3.4419999999999999E-2,0.2014,5.4149000000000003,0.12520000000000001,0.13239999999999999,16.169799999999999,8.7169999999999997E-2,1,38.872399999999999,3.014E-2]
[0.16666666666666666,1,58.424900000000001,3.424E-2,0.19700000000000001,5.5674999999999999,0.12385,0.1118,16.319500000000001,8.677E-2,1,39.128500000000003,2.997E-2]
[0.17248459958932238,1,58.653599999999997,3.4160000000000003E-2,0.19520000000000001,5.6318999999999999,0.12330000000000001,0.1032,16.378699999999998,8.6610000000000006E-2,1,39.236800000000002,2.9899999999999999E-2]
[0.19164955509924708,1,59.3872,3.3919999999999999E-2,0.18940000000000001,5.8346,0.12157,7.6600000000000001E-2,16.549399999999999,8.6120000000000002E-2,1,39.579700000000003,2.9690000000000001E-2]
[0.21081451060917181,1,60.089399999999998,3.3689999999999998E-2,0.184,6.0242000000000004,0.12001000000000001,5.1999999999999998E-2,16.688199999999998,8.5690000000000002E-2,1,39.903300000000002,2.9499999999999998E-2]
[0.2299794661190965,1,60.7605,3.3480000000000003E-2,0.1789,6.2019000000000002,0.1186,2.9100000000000001E-2,16.801600000000001,8.5309999999999997E-2,1,40.209600000000002,2.9329999999999998E-2]
[0.24914442162902123,1,61.401299999999999,3.329E-2,0.17399999999999999,6.3689999999999998,0.11731999999999999,7.7000000000000002E-3,16.895,8.4959999999999994E-2,1,40.500799999999998,2.9180000000000001E-2]
[0.25,1,61.429200000000002,3.3279999999999997E-2,0.17380000000000001,6.3761999999999999,0.11727,6.7999999999999996E-3,16.898700000000002,8.4949999999999998E-2,1,40.513500000000001,2.9180000000000001E-2]
[0.33333333333333331,1,63.886000000000003,3.2570000000000002E-2,0.15529999999999999,7.0023,0.11316,-7.2700000000000001E-2,17.157900000000001,8.3779999999999993E-2,1,41.631700000000002,2.8680000000000001E-2]
[0.41666666666666669,1,65.902600000000007,3.2039999999999999E-2,0.13950000000000001,7.5105000000000004,0.1108,-0.13700000000000001,17.291899999999998,8.2960000000000006E-2,1,42.557600000000001,2.8369999999999999E-2]
[0.5,1,67.623599999999996,3.1649999999999998E-2,0.12570000000000001,7.9340000000000002,0.10958,-0.1913,17.342199999999998,8.2339999999999997E-2,1,43.330599999999997,2.8170000000000001E-2]
[0.58333333333333337,1,69.164500000000004,3.1390000000000001E-2,0.1134,8.2970000000000006,0.10902000000000001,-0.23849999999999999,17.328800000000001,8.183E-2,1,43.9803,2.8039999999999999E-2]
[0.66666666666666663,1,70.599400000000003,3.124E-2,0.1021,8.6151,0.10882,-0.2802,17.264700000000001,8.14E-2,1,44.53,2.7959999999999999E-2]
[0.75,1,71.968699999999998,3.117E-2,9.1700000000000004E-2,8.9014000000000006,0.10881,-0.31759999999999999,17.1662,8.1019999999999995E-2,1,44.9998,2.792E-2]
[0.83333333333333337,1,73.281199999999998,3.1179999999999999E-2,8.2000000000000003E-2,9.1648999999999994,0.10891000000000001,-0.35160000000000002,17.0488,8.0680000000000002E-2,1,45.405099999999997,2.7900000000000001E-2]
[0.91666666666666663,1,74.538799999999995,3.125E-2,7.2999999999999995E-2,9.4122000000000003,0.10906,-0.38279999999999997,16.9239,8.0369999999999997E-2,1,45.757300000000001,2.7890000000000002E-2]
[1,1,75.748800000000003,3.1370000000000002E-2,6.4399999999999999E-2,9.6478999999999999,0.10925,-0.41149999999999998,16.798100000000002,8.0089999999999995E-2,1,46.066099999999999,2.7890000000000002E-2]
[1.0833333333333333,1,76.918599999999998,3.1539999999999999E-2,5.6300000000000003E-2,9.8749000000000002,0.10949,-0.43819999999999998,16.674299999999999,7.9820000000000002E-2,1,46.339500000000001,2.7890000000000002E-2]
[1.1666666666666667,1,78.049700000000001,3.1739999999999997E-2,4.87E-2,10.0953,0.10976,-0.46300000000000002,16.5548,7.9579999999999998E-2,1,46.584400000000002,2.7910000000000001E-2]
[1.25,1,79.145799999999994,3.1969999999999998E-2,4.1300000000000003E-2,10.3108,0.11007,-0.48630000000000001,16.440899999999999,7.9350000000000004E-2,1,46.805999999999997,2.792E-2]
[1.3333333333333333,1,80.211299999999994,3.2219999999999999E-2,3.4299999999999997E-2,10.5228,0.11040999999999999,-0.50819999999999999,16.333500000000001,7.9130000000000006E-2,1,47.008800000000001,2.7949999999999999E-2]
[1.4166666666666667,1,81.248699999999999,3.2500000000000001E-2,2.75E-2,10.7319,0.11079,-0.52890000000000004,16.232900000000001,7.8920000000000004E-2,1,47.196199999999997,2.7969999999999998E-2]
[1.5,1,82.258700000000005,3.279E-2,2.1100000000000001E-2,10.938499999999999,0.11119,-0.5484,16.139199999999999,7.8729999999999994E-2,1,47.371099999999998,2.8000000000000001E-2]
[1.5833333333333333,1,83.241799999999998,3.3099999999999997E-2,1.4800000000000001E-2,11.143000000000001,0.11164,-0.56689999999999996,16.052800000000001,7.8539999999999999E-2,1,47.535699999999999,2.8029999999999999E-2]
[1.6666666666666667,1,84.199600000000004,3.3419999999999998E-2,8.6999999999999994E-3,11.3462,0.11211,-0.58460000000000001,15.974299999999999,7.8359999999999999E-2,1,47.691899999999997,2.8060000000000002E-2]
[1.75,1,85.134799999999998,3.3759999999999998E-2,2.8999999999999998E-3,11.5486,0.11261,-0.60140000000000005,15.9039,7.8179999999999999E-2,1,47.840800000000002,2.81E-2]
[1.8333333333333333,1,86.047700000000006,3.4099999999999998E-2,-2.8E-3,11.750400000000001,0.11314,-0.61739999999999995,15.841200000000001,7.8020000000000006E-2,1,47.9833,2.8129999999999999E-2]
[1.9166666666666667,1,86.941000000000003,3.4450000000000001E-2,-8.3000000000000001E-3,11.9514,0.11369,-0.63280000000000003,15.7852,7.7859999999999999E-2,1,48.120100000000001,2.8170000000000001E-2]
[2,1,87.816100000000006,3.4790000000000001E-2,-1.37E-2,12.1515,0.11426,-0.64729999999999999,15.7356,7.7710000000000001E-2,1,48.2515,2.8209999999999999E-2]
[2,1,87.116100000000003,3.5069999999999997E-2,-1.37E-2,12.1515,0.11426,-0.61870000000000003,16.018899999999999,7.7850000000000003E-2,1,48.2515,2.8209999999999999E-2]
[2.0833333333333335,1,87.971999999999994,3.542E-2,-1.89E-2,12.350199999999999,0.11484999999999999,-0.58399999999999996,15.98,7.7920000000000003E-2,1,48.377699999999997,2.8250000000000001E-2]
[2.1666666666666665,1,88.8065,3.576E-2,-2.4E-2,12.5466,0.11544,-0.54969999999999997,15.9414,7.8E-2,1,48.498899999999999,2.8299999999999999E-2]
[2.25,1,89.619699999999995,3.61E-2,-2.8899999999999999E-2,12.7401,0.11604,-0.51659999999999995,15.903600000000001,7.8079999999999997E-2,1,48.615099999999998,2.8340000000000001E-2]
[2.3333333333333335,1,90.412000000000006,3.6420000000000001E-2,-3.3700000000000001E-2,12.930300000000001,0.11663999999999999,-0.48499999999999999,15.8667,7.8179999999999999E-2,1,48.726399999999998,2.8379999999999999E-2]
[2.4166666666666665,1,91.1828,3.6740000000000002E-2,-3.85E-2,13.116899999999999,0.11723,-0.45519999999999999,15.8306,7.8289999999999998E-2,1,48.833100000000002,2.8420000000000001E-2]
[2.5,1,91.932699999999997,3.7039999999999997E-2,-4.3099999999999999E-2,13.3,0.11781,-0.4274,15.795299999999999,7.8409999999999994E-2,1,48.935099999999998,2.8469999999999999E-2]
[2.5833333333333335,1,92.6631,3.7330000000000002E-2,-4.7600000000000003E-2,13.479799999999999,0.11839,-0.40160000000000001,15.7606,7.8539999999999999E-2,1,49.032699999999998,2.8510000000000001E-2]
[2.6666666666666665,1,93.375299999999996,3.7609999999999998E-2,-5.1999999999999998E-2,13.656700000000001,0.11896,-0.37819999999999998,15.726699999999999,7.8670000000000004E-2,1,49.125999999999998,2.8549999999999999E-2]
[2.75,1,94.071100000000001,3.7870000000000001E-2,-5.6399999999999999E-2,13.8309,0.11953,-0.35720000000000002,15.6934,7.8820000000000001E-2,1,49.215299999999999,2.8590000000000001E-2]
[2.8333333333333335,1,94.753200000000007,3.8120000000000001E-2,-6.0600000000000001E-2,14.0031,0.12008000000000001,-0.33879999999999999,15.661,7.8969999999999999E-2,1,49.300699999999999,2.8629999999999999E-2]
[2.9166666666666665,1,95.423599999999993,3.8359999999999998E-2,-6.4799999999999996E-2,14.1736,0.12062,-0.3231,15.6294,7.9140000000000002E-2,1,49.382599999999996,2.8670000000000001E-2]
[3,1,96.083500000000001,3.8580000000000003E-2,-6.8900000000000003E-2,14.3429,0.12116,-0.31009999999999999,15.598800000000001,7.9310000000000005E-2,1,49.461199999999998,2.8709999999999999E-2]
[3.0833333333333335,1,96.733699999999999,3.8789999999999998E-2,-7.2900000000000006E-2,14.5113,0.12168,-0.3,15.5693,7.9500000000000001E-2,1,49.536700000000003,2.8750000000000001E-2]
[3.1666666666666665,1,97.374899999999997,3.9E-2,-7.6899999999999996E-2,14.6791,0.1222,-0.29270000000000002,15.541,7.9689999999999997E-2,1,49.609299999999998,2.878E-2]
[3.25,1,98.007300000000001,3.9190000000000003E-2,-8.0799999999999997E-2,14.8466,0.12271,-0.28839999999999999,15.513999999999999,7.9899999999999999E-2,1,49.679099999999998,2.8819999999999998E-2]
[3.3333333333333335,1,98.631,3.9370000000000002E-2,-8.4599999999999995E-2,15.013999999999999,0.12322,-0.28689999999999999,15.4885,8.0119999999999997E-2,1,49.746499999999997,2.886E-2]
[3.4166666666666665,1,99.245900000000006,3.9539999999999999E-2,-8.8300000000000003E-2,15.1813,0.12373000000000001,-0.28810000000000002,15.464499999999999,8.0360000000000001E-2,1,49.811599999999999,2.8889999999999999E-2]
[3.5,1,99.851500000000001,3.9710000000000002E-2,-9.1999999999999998E-2,15.348599999999999,0.12425,-0.29189999999999999,15.442,8.0610000000000001E-2,1,49.874499999999998,2.8930000000000001E-2]
[3.5833333333333335,1,100.4485,3.986E-2,-9.5699999999999993E-2,15.5158,0.12478,-0.29809999999999998,15.420999999999999,8.0869999999999997E-2,1,49.935400000000001,2.896E-2]
[3.6666666666666665,1,101.03740000000001,4.002E-2,-9.9299999999999999E-2,15.6828,0.12531,-0.30669999999999997,15.401300000000001,8.115E-2,1,49.994199999999999,2.8989999999999998E-2]
[3.75,1,101.6186,4.0160000000000001E-2,-0.1028,15.8497,0.12586,-0.31740000000000002,15.3827,8.1439999999999999E-2,1,50.051200000000001,2.903E-2]
[3.8333333333333335,1,102.19329999999999,4.0309999999999999E-2,-0.10630000000000001,16.016300000000001,0.12642999999999999,-0.33029999999999998,15.3652,8.1739999999999993E-2,1,50.106400000000001,2.9059999999999999E-2]
[3.9166666666666665,1,102.7625,4.045E-2,-0.10970000000000001,16.182700000000001,0.127,-0.34520000000000001,15.3485,8.2049999999999998E-2,1,50.159799999999997,2.9090000000000001E-2]
[4,1,103.32729999999999,4.0590000000000001E-2,-0.11310000000000001,16.3489,0.12759000000000001,-0.36220000000000002,15.332599999999999,8.2379999999999995E-2,1,50.211500000000001,2.912E-2]
[4,1,102.49,4.0079999999999998E-2,-0.42599999999999999,16.550999999999998,0.11649,-1.2909999999999999,15.752000000000001,7.6840000000000006E-2,1,52.215000000000003,2.809E-2]
[4.0830000000000002,1,103.06,4.0210000000000003E-2,-0.437,16.708100000000002,0.11681999999999999,-1.3089999999999999,15.727,7.6869999999999994E-2,1,52.265999999999998,2.8129999999999999E-2]
[4.1669999999999998,1,103.64,4.0329999999999998E-2,-0.44800000000000001,16.8689,0.11717,-1.325,15.704000000000001,7.6920000000000002E-2,1,52.314999999999998,2.818E-2]
[4.25,1,104.22,4.045E-2,-0.45900000000000002,17.033000000000001,0.11752,-1.3420000000000001,15.682,7.6999999999999999E-2,1,52.362000000000002,2.8219999999999999E-2]
[4.3330000000000002,1,104.8,4.0570000000000002E-2,-0.47099999999999997,17.2011,0.11788,-1.359,15.662000000000001,7.7090000000000006E-2,1,52.408999999999999,2.827E-2]
[4.4169999999999998,1,105.4,4.0680000000000001E-2,-0.48199999999999998,17.372900000000001,0.11826,-1.375,15.644,7.7200000000000005E-2,1,52.454999999999998,2.8309999999999998E-2]
[4.5,1,106,4.0779999999999997E-2,-0.49399999999999999,17.547999999999998,0.11864,-1.391,15.625999999999999,7.7329999999999996E-2,1,52.499000000000002,2.835E-2]
[4.5830000000000002,1,106.6,4.0890000000000003E-2,-0.50600000000000001,17.725300000000001,0.11903,-1.407,15.61,7.7479999999999993E-2,1,52.542999999999999,2.8389999999999999E-2]
[4.6669999999999998,1,107.21,4.0980000000000003E-2,-0.51800000000000002,17.904299999999999,0.11942,-1.4219999999999999,15.595000000000001,7.7649999999999997E-2,1,52.585000000000001,2.8420000000000001E-2]
[4.75,1,107.81,4.1070000000000002E-2,-0.53,18.085999999999999,0.11983000000000001,-1.4370000000000001,15.582000000000001,7.7840000000000006E-2,1,52.625999999999998,2.8459999999999999E-2]
[4.8330000000000002,1,108.41,4.1149999999999999E-2,-0.54300000000000004,18.267299999999999,0.12025,-1.452,15.569000000000001,7.8060000000000004E-2,1,52.667000000000002,2.8490000000000001E-2]
[4.9169999999999998,1,109.01,4.1230000000000003E-2,-0.55500000000000005,18.450700000000001,0.12067,-1.4670000000000001,15.557,7.8289999999999998E-2,1,52.707999999999998,2.852E-2]
[5,1,109.59,4.1309999999999999E-2,-0.56699999999999995,18.632999999999999,0.1211,-1.4810000000000001,15.547000000000001,7.8560000000000005E-2,1,52.747,2.8549999999999999E-2]
[5.0830000000000002,1,110.16,4.1369999999999997E-2,-0.57899999999999996,18.814299999999999,0.12154,-1.4950000000000001,15.538,7.8839999999999993E-2,1,52.786000000000001,2.8580000000000001E-2]
[5.1669999999999998,1,110.73,4.1439999999999998E-2,-0.59099999999999997,18.994199999999999,0.12198000000000001,-1.5089999999999999,15.53,7.9149999999999998E-2,1,52.823,2.861E-2]
[5.25,1,111.28,4.1489999999999999E-2,-0.60299999999999998,19.172000000000001,0.12243,-1.5229999999999999,15.523,7.9479999999999995E-2,1,52.86,2.8639999999999999E-2]
[5.3330000000000002,1,111.81,4.1549999999999997E-2,-0.61499999999999999,19.349,0.12289,-1.536,15.516999999999999,7.9829999999999998E-2,1,52.896000000000001,2.8670000000000001E-2]
[5.4169999999999998,1,112.35,4.1599999999999998E-2,-0.627,19.525300000000001,0.12335,-1.5489999999999999,15.510999999999999,8.0199999999999994E-2,1,52.932000000000002,2.869E-2]
[5.5,1,112.87,4.165E-2,-0.63900000000000001,19.701000000000001,0.12383,-1.5620000000000001,15.507,8.0589999999999995E-2,1,52.966999999999999,2.8719999999999999E-2]
[5.5830000000000002,1,113.38,4.1700000000000001E-2,-0.65100000000000002,19.8767,0.12432,-1.575,15.503,8.1000000000000003E-2,1,53.002000000000002,2.8740000000000002E-2]
[5.6669999999999998,1,113.9,4.1739999999999999E-2,-0.66300000000000003,20.052299999999999,0.12482,-1.587,15.5,8.1430000000000002E-2,1,53.036000000000001,2.8760000000000001E-2]
[5.75,1,114.41,4.1779999999999998E-2,-0.67500000000000004,20.228999999999999,0.12534000000000001,-1.599,15.497999999999999,8.1890000000000004E-2,1,53.07,2.878E-2]
[5.8330000000000002,1,114.92,4.1820000000000003E-2,-0.68700000000000006,20.407699999999998,0.12587000000000001,-1.611,15.497,8.2350000000000007E-2,1,53.103000000000002,2.8799999999999999E-2]
[5.9169999999999998,1,115.43,4.1860000000000001E-2,-0.69899999999999995,20.5867,0.12642,-1.6220000000000001,15.497,8.2839999999999997E-2,1,53.136000000000003,2.8830000000000001E-2]
[6,1,115.93,4.19E-2,-0.71099999999999997,20.766999999999999,0.12698999999999999,-1.6339999999999999,15.497999999999999,8.3339999999999997E-2,1,53.167999999999999,2.8840000000000001E-2]
[6.0830000000000002,1,116.44,4.1930000000000002E-2,-0.72299999999999998,20.948699999999999,0.12756999999999999,-1.6439999999999999,15.499000000000001,8.3860000000000004E-2,1,53.2,2.886E-2]
[6.1669999999999998,1,116.94,4.197E-2,-0.73499999999999999,21.130299999999998,0.12816,-1.655,15.500999999999999,8.4390000000000007E-2,1,53.231999999999999,2.8879999999999999E-2]
[6.25,1,117.44,4.2000000000000003E-2,-0.748,21.312999999999999,0.12877,-1.665,15.503,8.4940000000000002E-2,1,53.264000000000003,2.8899999999999999E-2]
[6.3330000000000002,1,117.94,4.2029999999999998E-2,-0.76,21.498100000000001,0.12939000000000001,-1.675,15.507,8.5489999999999997E-2,1,53.293999999999997,2.8920000000000001E-2]
[6.4169999999999998,1,118.43,4.206E-2,-0.77200000000000002,21.684200000000001,0.13003000000000001,-1.6850000000000001,15.510999999999999,8.6059999999999998E-2,1,53.325000000000003,2.8930000000000001E-2]
[6.5,1,118.93,4.2090000000000002E-2,-0.78500000000000003,21.872,0.13067999999999999,-1.694,15.516,8.6629999999999999E-2,1,53.356000000000002,2.895E-2]
[6.5830000000000002,1,119.42,4.2119999999999998E-2,-0.79700000000000004,22.062100000000001,0.13136,-1.704,15.522,8.7220000000000006E-2,1,53.387,2.896E-2]
[6.6669999999999998,1,119.91,4.2160000000000003E-2,-0.81,22.254899999999999,0.13205,-1.7130000000000001,15.529,8.7809999999999999E-2,1,53.415999999999997,2.8979999999999999E-2]
[6.75,1,120.41,4.2189999999999998E-2,-0.82299999999999995,22.45,0.13275999999999999,-1.7210000000000001,15.536,8.8410000000000002E-2,1,53.445999999999998,2.8989999999999998E-2]
[6.8330000000000002,1,120.9,4.2229999999999997E-2,-0.83599999999999997,22.6478,0.13349,-1.73,15.545,8.9010000000000006E-2,1,53.475999999999999,2.9000000000000001E-2]
[6.9169999999999998,1,121.4,4.2270000000000002E-2,-0.84899999999999998,22.847999999999999,0.13425000000000001,-1.738,15.554,8.9620000000000005E-2,1,53.505000000000003,2.9020000000000001E-2]
[7,1,121.9,4.231E-2,-0.86099999999999999,23.050999999999998,0.13502,-1.7450000000000001,15.564,9.0230000000000005E-2,1,53.533999999999999,2.903E-2]
[7.0830000000000002,1,122.4,4.2360000000000002E-2,-0.874,23.2576,0.13580999999999999,-1.7529999999999999,15.574999999999999,9.0840000000000004E-2,1,53.563000000000002,2.904E-2]
[7.1669999999999998,1,122.9,4.24E-2,-0.88700000000000001,23.465699999999998,0.13661999999999999,-1.76,15.587,9.1450000000000004E-2,1,53.591000000000001,2.9049999999999999E-2]
[7.25,1,123.4,4.2450000000000002E-2,-0.9,23.675999999999998,0.13744000000000001,-1.7669999999999999,15.6,9.2069999999999999E-2,1,53.62,2.9069999999999999E-2]
[7.3330000000000002,1,123.9,4.249E-2,-0.91300000000000003,23.8873,0.13827,-1.774,15.614000000000001,9.2679999999999998E-2,1,53.649000000000001,2.9080000000000002E-2]
[7.4169999999999998,1,124.4,4.2540000000000001E-2,-0.92500000000000004,24.100100000000001,0.13911999999999999,-1.7809999999999999,15.628,9.3299999999999994E-2,1,53.676000000000002,2.9090000000000001E-2]
[7.5,1,124.9,4.2590000000000003E-2,-0.93700000000000006,24.314,0.13997999999999999,-1.7869999999999999,15.643000000000001,9.3909999999999993E-2,1,53.704000000000001,2.9100000000000001E-2]
[7.5830000000000002,1,125.4,4.2630000000000001E-2,-0.94899999999999995,24.529299999999999,0.14083999999999999,-1.7929999999999999,15.659000000000001,9.4509999999999997E-2,1,53.731999999999999,2.911E-2]
[7.6669999999999998,1,125.89,4.267E-2,-0.96099999999999997,24.746700000000001,0.14171,-1.798,15.675000000000001,9.5119999999999996E-2,1,53.76,2.912E-2]
[7.75,1,126.39,4.2720000000000001E-2,-0.97199999999999998,24.965,0.14258999999999999,-1.804,15.692,9.572E-2,1,53.786999999999999,2.913E-2]
[7.8330000000000002,1,126.87,4.2759999999999999E-2,-0.98299999999999998,25.184899999999999,0.14346,-1.8089999999999999,15.71,9.6320000000000003E-2,1,53.814,2.9139999999999999E-2]
[7.9169999999999998,1,127.36,4.2799999999999998E-2,-0.99399999999999999,25.407,0.14434,-1.8140000000000001,15.728999999999999,9.6909999999999996E-2,1,53.841000000000001,2.9149999999999999E-2]
[8,1,127.85,4.2840000000000003E-2,-1.0049999999999999,25.63,0.14521999999999999,-1.8180000000000001,15.747999999999999,9.7489999999999993E-2,1,53.866999999999997,2.9159999999999998E-2]
[8.0830000000000002,1,128.33000000000001,4.2889999999999998E-2,-1.0149999999999999,25.855,0.14609,-1.823,15.768000000000001,9.8070000000000004E-2,1,53.893000000000001,2.9170000000000001E-2]
[8.1669999999999998,1,128.80000000000001,4.2930000000000003E-2,-1.024,26.081399999999999,0.14696000000000001,-1.827,15.789,9.8640000000000005E-2,1,53.92,2.9180000000000001E-2]
[8.25,1,129.27000000000001,4.2970000000000001E-2,-1.034,26.308,0.14782000000000001,-1.83,15.81,9.9199999999999997E-2,1,53.945999999999998,2.9190000000000001E-2]
[8.3330000000000002,1,129.74,4.3020000000000003E-2,-1.042,26.536300000000001,0.14868000000000001,-1.8340000000000001,15.833,9.9760000000000001E-2,1,53.972000000000001,2.92E-2]
[8.4169999999999998,1,130.19,4.3069999999999997E-2,-1.0509999999999999,26.765499999999999,0.14953,-1.837,15.855,0.1003,1,53.997999999999998,2.921E-2]
[8.5,1,130.63999999999999,4.3119999999999999E-2,-1.0580000000000001,26.995999999999999,0.15038000000000001,-1.84,15.88,0.10084,1,54.024000000000001,2.9219999999999999E-2]
[8.5830000000000002,1,131.09,4.3180000000000003E-2,-1.0649999999999999,27.226900000000001,0.15121000000000001,-1.843,15.904,0.10137,1,54.05,2.9229999999999999E-2]
[8.6669999999999998,1,131.54,4.3240000000000001E-2,-1.0720000000000001,27.457999999999998,0.15204000000000001,-1.8460000000000001,15.929,0.10188999999999999,1,54.076000000000001,2.9239999999999999E-2]
[8.75,1,131.97,4.3299999999999998E-2,-1.0780000000000001,27.69,0.15286,-1.8480000000000001,15.955,0.1024,1,54.100999999999999,2.9250000000000002E-2]
[8.8330000000000002,1,132.41,4.3369999999999999E-2,-1.083,27.922000000000001,0.15365999999999999,-1.85,15.981999999999999,0.10290000000000001,1,54.125999999999998,2.9260000000000001E-2]
[8.9169999999999998,1,132.84,4.3439999999999999E-2,-1.0880000000000001,28.1557,0.15445999999999999,-1.8520000000000001,16.009,0.10340000000000001,1,54.152000000000001,2.9260000000000001E-2]
[9,1,133.28,4.351E-2,-1.0920000000000001,28.39,0.15525,-1.8540000000000001,16.036999999999999,0.10388,1,54.177999999999997,2.9270000000000001E-2]
[9.0830000000000002,1,133.71,4.3589999999999997E-2,-1.095,28.6266,0.15601999999999999,-1.855,16.065999999999999,0.10435,1,54.203000000000003,2.928E-2]
[9.1669999999999998,1,134.13999999999999,4.367E-2,-1.0980000000000001,28.863700000000001,0.15676999999999999,-1.8560000000000001,16.094999999999999,0.10482,1,54.228999999999999,2.929E-2]
[9.25,1,134.57,4.376E-2,-1.101,29.103000000000002,0.15751000000000001,-1.857,16.125,0.10527,1,54.253999999999998,2.93E-2]
[9.3330000000000002,1,134.99,4.3839999999999997E-2,-1.103,29.343,0.15823999999999999,-1.8580000000000001,16.155000000000001,0.10571,1,54.279000000000003,2.9309999999999999E-2]
[9.4169999999999998,1,135.41999999999999,4.394E-2,-1.1040000000000001,29.585000000000001,0.15895000000000001,-1.8580000000000001,16.187000000000001,0.10614999999999999,1,54.305,2.9319999999999999E-2]
[9.5,1,135.84,4.403E-2,-1.105,29.827999999999999,0.15962999999999999,-1.859,16.219000000000001,0.10657,1,54.33,2.9329999999999998E-2]
[9.5830000000000002,1,136.26,4.4130000000000003E-2,-1.105,30.074000000000002,0.16031000000000001,-1.859,16.251000000000001,0.10698000000000001,1,54.354999999999997,2.9329999999999998E-2]
[9.6669999999999998,1,136.68,4.4229999999999998E-2,-1.1040000000000001,30.323,0.16095999999999999,-1.859,16.283999999999999,0.10738,1,54.38,2.9340000000000001E-2]
[9.75,1,137.1,4.4330000000000001E-2,-1.103,30.574000000000002,0.16161,-1.859,16.318000000000001,0.10777,1,54.405999999999999,2.9350000000000001E-2]
[9.8330000000000002,1,137.53,4.444E-2,-1.1020000000000001,30.829000000000001,0.16224,-1.859,16.352,0.10815,1,54.430999999999997,2.9360000000000001E-2]
[9.9169999999999998,1,137.96,4.4560000000000002E-2,-1.099,31.087599999999998,0.16286,-1.8580000000000001,16.387,0.10852000000000001,1,54.457000000000001,2.937E-2]
[10,1,138.38999999999999,4.4679999999999997E-2,-1.097,31.35,0.16347,-1.857,16.422999999999998,0.10888,1,54.481999999999999,2.938E-2]
[10.083,1,138.82,4.48E-2,-1.093,31.614999999999998,0.16408,-1.8560000000000001,16.459,0.10922999999999999,1,54.506999999999998,2.938E-2]
[10.167,1,139.26,4.4929999999999998E-2,-1.089,31.882999999999999,0.16469,-1.855,16.495999999999999,0.10957,1,54.533000000000001,2.9389999999999999E-2]
[10.25,1,139.69,4.5060000000000003E-2,-1.085,32.152000000000001,0.16528000000000001,-1.8540000000000001,16.533000000000001,0.1099,1,54.558,2.9399999999999999E-2]
[10.333,1,140.12,4.5199999999999997E-2,-1.08,32.422400000000003,0.16588,-1.853,16.57,0.11022,1,54.584000000000003,2.9409999999999999E-2]
[10.417,1,140.54,4.5339999999999998E-2,-1.0740000000000001,32.693399999999997,0.16647999999999999,-1.851,16.609000000000002,0.11054,1,54.61,2.9420000000000002E-2]
[10.5,1,140.96,4.548E-2,-1.0680000000000001,32.963999999999999,0.16707,-1.85,16.648,0.11083999999999999,1,54.634999999999998,2.9430000000000001E-2]
[10.583,1,141.37,4.5620000000000001E-2,-1.0609999999999999,33.234000000000002,0.16766,-1.8480000000000001,16.687000000000001,0.11114,1,54.661000000000001,2.9430000000000001E-2]
[10.667,1,141.78,4.5769999999999998E-2,-1.0529999999999999,33.503599999999999,0.16825000000000001,-1.8460000000000001,16.727,0.11143,1,54.686999999999998,2.9440000000000001E-2]
[10.75,1,142.18,4.5920000000000002E-2,-1.0449999999999999,33.774000000000001,0.16883999999999999,-1.8440000000000001,16.768000000000001,0.11169999999999999,1,54.713000000000001,2.945E-2]
[10.833,1,142.58000000000001,4.607E-2,-1.0369999999999999,34.043700000000001,0.16943,-1.8420000000000001,16.808,0.11197,1,54.74,2.946E-2]
[10.917,1,142.97999999999999,4.623E-2,-1.0269999999999999,34.314300000000003,0.17000999999999999,-1.839,16.850000000000001,0.11223,1,54.765999999999998,2.946E-2]
[11,1,143.37,4.6379999999999998E-2,-1.018,34.585000000000001,0.1706,-1.837,16.891999999999999,0.11249000000000001,1,54.792999999999999,2.947E-2]
[11.083,1,143.77000000000001,4.6539999999999998E-2,-1.0069999999999999,34.8568,0.17119000000000001,-1.8340000000000001,16.934999999999999,0.11273,1,54.82,2.9479999999999999E-2]
[11.167,1,144.16,4.6699999999999998E-2,-0.996,35.129800000000003,0.17176,-1.831,16.977,0.11296,1,54.845999999999997,2.9489999999999999E-2]
[11.25,1,144.55000000000001,4.6870000000000002E-2,-0.98499999999999999,35.405000000000001,0.17233000000000001,-1.829,17.02,0.11319,1,54.874000000000002,2.9489999999999999E-2]
[11.333,1,144.94999999999999,4.7039999999999998E-2,-0.97299999999999998,35.682299999999998,0.17288999999999999,-1.8260000000000001,17.065000000000001,0.11341,1,54.902000000000001,2.9499999999999998E-2]
[11.417,1,145.34,4.7210000000000002E-2,-0.96,35.963299999999997,0.17343,-1.823,17.108000000000001,0.11362,1,54.929000000000002,2.9510000000000002E-2]
[11.5,1,145.75,4.7379999999999999E-2,-0.94699999999999995,36.25,0.17397000000000001,-1.819,17.154,0.11382,1,54.956000000000003,2.9520000000000001E-2]
[11.583,1,146.16,4.7550000000000002E-2,-0.93300000000000005,36.543199999999999,0.17449000000000001,-1.8160000000000001,17.199000000000002,0.11402,1,54.984000000000002,2.9520000000000001E-2]
[11.667,1,146.58000000000001,4.7739999999999998E-2,-0.91800000000000004,36.842300000000002,0.17499999999999999,-1.8129999999999999,17.244,0.1142,1,55.012,2.9530000000000001E-2]
[11.75,1,147.02000000000001,4.7919999999999997E-2,-0.90300000000000002,37.149000000000001,0.17549999999999999,-1.8089999999999999,17.291,0.11438,1,55.04,2.954E-2]
[11.833,1,147.46,4.8099999999999997E-2,-0.88700000000000001,37.463799999999999,0.17599000000000001,-1.806,17.338000000000001,0.11456,1,55.069000000000003,2.955E-2]
[11.917,1,147.91,4.829E-2,-0.87,37.787700000000001,0.17646999999999999,-1.802,17.385999999999999,0.11472,1,55.097999999999999,2.955E-2]
[12,1,148.36000000000001,4.8480000000000002E-2,-0.85199999999999998,38.122,0.17691999999999999,-1.7989999999999999,17.433,0.11488,1,55.125999999999998,2.9559999999999999E-2]
[12.083,1,148.83000000000001,4.8680000000000001E-2,-0.83399999999999996,38.465299999999999,0.17735999999999999,-1.7949999999999999,17.481000000000002,0.11502999999999999,1,55.155000000000001,2.9569999999999999E-2]
[12.167,1,149.31,4.8869999999999997E-2,-0.81599999999999995,38.820099999999996,0.17777999999999999,-1.7909999999999999,17.53,0.11516999999999999,1,55.183999999999997,2.9569999999999999E-2]
[12.25,1,149.81,4.9059999999999999E-2,-0.79600000000000004,39.185000000000002,0.1782,-1.7869999999999999,17.579000000000001,0.11532000000000001,1,55.213999999999999,2.9579999999999999E-2]
[12.333,1,150.31,4.9259999999999998E-2,-0.77600000000000002,39.561900000000001,0.17860000000000001,-1.7829999999999999,17.629000000000001,0.11545,1,55.243000000000002,2.9590000000000002E-2]
[12.417,1,150.83000000000001,4.9450000000000001E-2,-0.755,39.949399999999997,0.17899999999999999,-1.78,17.678999999999998,0.11558,1,55.271999999999998,2.9590000000000002E-2]
[12.5,1,151.35,4.9639999999999997E-2,-0.73399999999999999,40.347999999999999,0.17938000000000001,-1.776,17.728999999999999,0.1157,1,55.302,2.9600000000000001E-2]
[12.583,1,151.88999999999999,4.9829999999999999E-2,-0.71199999999999997,40.7577,0.17978,-1.7709999999999999,17.779,0.11581,1,55.332000000000001,2.9610000000000001E-2]
[12.667,1,152.44,5.0009999999999999E-2,-0.69,41.177799999999998,0.18017,-1.7669999999999999,17.829999999999998,0.11592,1,55.362000000000002,2.9610000000000001E-2]
[12.75,1,153,5.0189999999999999E-2,-0.66800000000000004,41.609000000000002,0.18057000000000001,-1.7629999999999999,17.881,0.11602999999999999,1,55.392000000000003,2.962E-2]
[12.833,1,153.58000000000001,5.0369999999999998E-2,-0.64500000000000002,42.050899999999999,0.18095,-1.7589999999999999,17.933,0.11613,1,55.421999999999997,2.963E-2]
[12.917,1,154.16999999999999,5.0529999999999999E-2,-0.622,42.505200000000002,0.18135000000000001,-1.7549999999999999,17.984999999999999,0.11622,1,55.453000000000003,2.963E-2]
[13,1,154.77000000000001,5.0680000000000003E-2,-0.59899999999999998,42.97,0.18173,-1.75,18.036999999999999,0.11631,1,55.484000000000002,2.964E-2]
[13.083,1,155.38,5.083E-2,-0.57499999999999996,43.445700000000002,0.18210000000000001,-1.746,18.088999999999999,0.11638999999999999,1,55.514000000000003,2.964E-2]
[13.167,1,156,5.0950000000000002E-2,-0.55200000000000005,43.932000000000002,0.18245,-1.742,18.141999999999999,0.11647,1,55.545999999999999,2.9649999999999999E-2]
[13.25,1,156.63,5.1069999999999997E-2,-0.53,44.427999999999997,0.18278,-1.738,18.193999999999999,0.11655,1,55.576000000000001,2.9659999999999999E-2]
[13.333,1,157.27000000000001,5.1159999999999997E-2,-0.50700000000000001,44.9328,0.18307000000000001,-1.7330000000000001,18.247,0.11662,1,55.607999999999997,2.9659999999999999E-2]
[13.417,1,157.91,5.1229999999999998E-2,-0.48499999999999999,45.444499999999998,0.18334,-1.7290000000000001,18.3,0.11668000000000001,1,55.639000000000003,2.9669999999999998E-2]
[13.5,1,158.55000000000001,5.1290000000000002E-2,-0.46300000000000002,45.963000000000001,0.18359,-1.724,18.353999999999999,0.11674,1,55.67,2.9669999999999998E-2]
[13.583,1,159.19999999999999,5.1319999999999998E-2,-0.442,46.486800000000002,0.18379999999999999,-1.72,18.407,0.1168,1,55.701000000000001,2.9680000000000002E-2]
[13.667,1,159.84,5.1330000000000001E-2,-0.42199999999999999,47.015300000000003,0.18396999999999999,-1.7150000000000001,18.46,0.11685,1,55.731999999999999,2.9690000000000001E-2]
[13.75,1,160.47,5.1310000000000001E-2,-0.40300000000000002,47.546999999999997,0.18411,-1.7110000000000001,18.513999999999999,0.1169,1,55.764000000000003,2.9690000000000001E-2]
[13.833,1,161.11000000000001,5.126E-2,-0.38400000000000001,48.081000000000003,0.18421000000000001,-1.7070000000000001,18.567,0.11695,1,55.795000000000002,2.9700000000000001E-2]
[13.917,1,161.74,5.1200000000000002E-2,-0.36699999999999999,48.6173,0.18426999999999999,-1.702,18.620999999999999,0.11699,1,55.826999999999998,2.9700000000000001E-2]
[14,1,162.36000000000001,5.11E-2,-0.35099999999999998,49.154000000000003,0.18428,-1.6970000000000001,18.675000000000001,0.11703,1,55.857999999999997,2.971E-2]
[14.083,1,162.97,5.0979999999999998E-2,-0.33600000000000002,49.6907,0.18425,-1.6930000000000001,18.728999999999999,0.11706,1,55.889000000000003,2.971E-2]
[14.167,1,163.58000000000001,5.083E-2,-0.32200000000000001,50.225900000000003,0.18415000000000001,-1.6890000000000001,18.783000000000001,0.1171,1,55.920999999999999,2.972E-2]
[14.25,1,164.17,5.0650000000000001E-2,-0.31,50.76,0.18398999999999999,-1.6839999999999999,18.835999999999999,0.11712,1,55.953000000000003,2.972E-2]
[14.333,1,164.75,5.0450000000000002E-2,-0.29899999999999999,51.291499999999999,0.18376000000000001,-1.68,18.89,0.11715,1,55.982999999999997,2.9729999999999999E-2]
[14.417,1,165.33,5.0229999999999997E-2,-0.28899999999999998,51.819200000000002,0.18346000000000001,-1.675,18.943999999999999,0.11717,1,56.014000000000003,2.9729999999999999E-2]
[14.5,1,165.88,4.9979999999999997E-2,-0.28100000000000003,52.343000000000004,0.18309,-1.671,18.997,0.11719,1,56.045999999999999,2.9739999999999999E-2]
[14.583,1,166.43,4.9709999999999997E-2,-0.27500000000000002,52.861800000000002,0.18262999999999999,-1.6659999999999999,19.050999999999998,0.11720999999999999,1,56.076999999999998,2.9739999999999999E-2]
[14.667,1,166.96,4.9419999999999999E-2,-0.26900000000000002,53.375,0.18209,-1.661,19.103999999999999,0.11722,1,56.107999999999997,2.9749999999999999E-2]
[14.75,1,167.48,4.9119999999999997E-2,-0.26600000000000001,53.883000000000003,0.18146000000000001,-1.657,19.158000000000001,0.11723,1,56.139000000000003,2.9749999999999999E-2]
[14.833,1,167.98,4.879E-2,-0.26300000000000001,54.384999999999998,0.18074999999999999,-1.6519999999999999,19.210999999999999,0.11724,1,56.17,2.9760000000000002E-2]
[14.917,1,168.47,4.8460000000000003E-2,-0.26300000000000001,54.880699999999997,0.17995,-1.6479999999999999,19.263999999999999,0.11724,1,56.201000000000001,2.9760000000000002E-2]
[15,1,168.94,4.811E-2,-0.26300000000000001,55.369,0.17907999999999999,-1.643,19.317,0.11724999999999999,1,56.231999999999999,2.9770000000000001E-2]
[15.083,1,169.4,4.7759999999999997E-2,-0.26500000000000001,55.850999999999999,0.17813000000000001,-1.639,19.37,0.11724999999999999,1,56.262,2.9770000000000001E-2]
[15.167,1,169.84,4.7399999999999998E-2,-0.26800000000000002,56.324199999999998,0.17710000000000001,-1.635,19.422999999999998,0.11724999999999999,1,56.292999999999999,2.9780000000000001E-2]
[15.25,1,170.26,4.7030000000000002E-2,-0.27200000000000002,56.789700000000003,0.17599999999999999,-1.63,19.475000000000001,0.11724,1,56.323999999999998,2.9780000000000001E-2]
[15.333,1,170.67,4.666E-2,-0.27800000000000002,57.247399999999999,0.17482,-1.6259999999999999,19.527999999999999,0.11724,1,56.353999999999999,2.9790000000000001E-2]
[15.417,1,171.06,4.6300000000000001E-2,-0.28399999999999997,57.696599999999997,0.17357,-1.621,19.579000000000001,0.11723,1,56.384,2.9790000000000001E-2]
[15.5,1,171.43,4.5940000000000002E-2,-0.29199999999999998,58.137999999999998,0.17226,-1.617,19.632000000000001,0.11722,1,56.414000000000001,2.98E-2]
[15.583,1,171.79,4.5580000000000002E-2,-0.3,58.569699999999997,0.17086999999999999,-1.6120000000000001,19.683,0.11720999999999999,1,56.444000000000003,2.98E-2]
[15.667,1,172.14,4.5220000000000003E-2,-0.309,58.993299999999998,0.16944000000000001,-1.6080000000000001,19.734999999999999,0.11719,1,56.473999999999997,2.98E-2]
[15.75,1,172.48,4.4880000000000003E-2,-0.31900000000000001,59.407400000000003,0.16797000000000001,-1.603,19.786000000000001,0.11718000000000001,1,56.503,2.981E-2]
[15.833,1,172.79,4.4540000000000003E-2,-0.33,59.811599999999999,0.16644999999999999,-1.599,19.837,0.11716,1,56.533000000000001,2.981E-2]
[15.917,1,173.1,4.4209999999999999E-2,-0.34100000000000003,60.204700000000003,0.16491,-1.595,19.887,0.11713999999999999,1,56.561999999999998,2.9819999999999999E-2]
[16,1,173.39,4.3889999999999998E-2,-0.35199999999999998,60.588000000000001,0.16336000000000001,-1.59,19.937999999999999,0.11712,1,56.591000000000001,2.9819999999999999E-2]
[16.082999999999998,1,173.66,4.3580000000000001E-2,-0.36399999999999999,60.959699999999998,0.1618,-1.5860000000000001,19.988,0.1171,1,56.621000000000002,2.9829999999999999E-2]
[16.167000000000002,1,173.93,4.3279999999999999E-2,-0.376,61.319499999999998,0.16025,-1.5820000000000001,20.038,0.11708,1,56.65,2.9829999999999999E-2]
[16.25,1,174.18,4.2999999999999997E-2,-0.38700000000000001,61.667999999999999,0.15872,-1.577,20.087,0.11706,1,56.679000000000002,2.9839999999999998E-2]
[16.332999999999998,1,174.42,4.2729999999999997E-2,-0.39900000000000002,62.005299999999998,0.15722,-1.573,20.137,0.11703,1,56.707000000000001,2.9839999999999998E-2]
[16.417000000000002,1,174.64,4.2459999999999998E-2,-0.41099999999999998,62.3324,0.15576000000000001,-1.569,20.186,0.11700000000000001,1,56.735999999999997,2.9839999999999998E-2]
[16.5,1,174.86,4.2220000000000001E-2,-0.42199999999999999,62.646999999999998,0.15434,-1.5640000000000001,20.234000000000002,0.11698,1,56.764000000000003,2.9850000000000002E-2]
[16.582999999999998,1,175.06,4.1980000000000003E-2,-0.434,62.951900000000002,0.15296999999999999,-1.56,20.282,0.11695,1,56.792000000000002,2.9850000000000002E-2]
[16.667000000000002,1,175.25,4.1750000000000002E-2,-0.44500000000000001,63.246299999999998,0.15165999999999999,-1.556,20.329999999999998,0.11692,1,56.820999999999998,2.9850000000000002E-2]
[16.75,1,175.43,4.1540000000000001E-2,-0.45600000000000002,63.530999999999999,0.15040999999999999,-1.5509999999999999,20.378,0.11688999999999999,1,56.848999999999997,2.9860000000000001E-2]
[16.832999999999998,1,175.61,4.1340000000000002E-2,-0.46700000000000003,63.805999999999997,0.14921999999999999,-1.5469999999999999,20.425000000000001,0.11686000000000001,1,56.875999999999998,2.9860000000000001E-2]
[16.917000000000002,1,175.77,4.1140000000000003E-2,-0.47799999999999998,64.071700000000007,0.14807000000000001,-1.5429999999999999,20.472000000000001,0.11683,1,56.904000000000003,2.9870000000000001E-2]
[17,1,175.92,4.0960000000000003E-2,-0.48899999999999999,64.328999999999994,0.14699000000000001,-1.538,20.518999999999998,0.1168,1,56.932000000000002,2.9870000000000001E-2]
[17.082999999999998,1,176.07,4.079E-2,-0.5,64.578199999999995,0.14596000000000001,-1.534,20.565000000000001,0.11677,1,56.96,2.9870000000000001E-2]
[17.167000000000002,1,176.21,4.0629999999999999E-2,-0.51,64.818700000000007,0.14498,-1.53,20.611000000000001,0.11674,1,56.987000000000002,2.988E-2]
[17.25,1,176.33,4.0469999999999999E-2,-0.52,65.051000000000002,0.14407,-1.526,20.655999999999999,0.1167,1,57.014000000000003,2.988E-2]
[17.332999999999998,1,176.45,4.0329999999999998E-2,-0.53,65.276799999999994,0.14319999999999999,-1.5209999999999999,20.702000000000002,0.11667,1,57.040999999999997,2.989E-2]
[17.417000000000002,1,176.57,4.02E-2,-0.53900000000000003,65.493300000000005,0.14238000000000001,-1.5169999999999999,20.745999999999999,0.11663,1,57.067999999999998,2.989E-2]
[17.5,1,176.67,4.0079999999999998E-2,-0.54900000000000004,65.703999999999994,0.14161000000000001,-1.5129999999999999,20.791,0.1166,1,57.094999999999999,2.989E-2]
[17.582999999999998,1,176.76,3.9969999999999999E-2,-0.55800000000000005,65.906899999999993,0.14088000000000001,-1.5089999999999999,20.835999999999999,0.11656999999999999,1,57.121000000000002,2.9899999999999999E-2]
[17.667000000000002,1,176.85,3.9870000000000003E-2,-0.56699999999999995,66.103300000000004,0.14019999999999999,-1.5049999999999999,20.879000000000001,0.11652999999999999,1,57.148000000000003,2.9899999999999999E-2]
[17.75,1,176.92,3.9789999999999999E-2,-0.57499999999999996,66.292000000000002,0.13955999999999999,-1.5009999999999999,20.922999999999998,0.11649,1,57.173999999999999,2.9899999999999999E-2]
[17.832999999999998,1,176.99,3.9710000000000002E-2,-0.58299999999999996,66.476500000000001,0.13896,-1.496,20.966999999999999,0.11645999999999999,1,57.201000000000001,2.9909999999999999E-2]
[17.917000000000002,1,177.04,3.9640000000000002E-2,-0.59099999999999997,66.6541,0.13839000000000001,-1.492,21.009,0.11642,1,57.226999999999997,2.9909999999999999E-2]
[18,1,177.09,3.9579999999999997E-2,-0.59899999999999998,66.823999999999998,0.13786000000000001,-1.488,21.052,0.11638999999999999,1,57.26,2.9909999999999999E-2]
[18.082999999999998,1,177.13,3.9530000000000003E-2,-0.60599999999999998,66.988299999999995,0.13735,-1.484,21.094999999999999,0.11635]
[18.167000000000002,1,177.17,3.9480000000000001E-2,-0.61299999999999999,67.147000000000006,0.13688,-1.48,21.135999999999999,0.11631]
[18.25,1,177.2,3.9449999999999999E-2,-0.62,67.3,0.13643,-1.476,21.178000000000001,0.11627999999999999]
[18.332999999999998,1,177.23,3.9419999999999997E-2,-0.627,67.447999999999993,0.13600999999999999,-1.472,21.22,0.11624]
[18.417000000000002,1,177.25,3.9399999999999998E-2,-0.63300000000000001,67.589799999999997,0.13561000000000001,-1.4670000000000001,21.26,0.1162]
[18.5,1,177.26,3.9379999999999998E-2,-0.63900000000000001,67.727999999999994,0.13522999999999999,-1.4630000000000001,21.300999999999998,0.11617]
[18.582999999999998,1,177.27,3.9370000000000002E-2,-0.64500000000000002,67.860699999999994,0.13488,-1.4590000000000001,21.341999999999999,0.11613]
[18.667000000000002,1,177.27,3.9359999999999999E-2,-0.65100000000000002,67.988,0.13453000000000001,-1.4550000000000001,21.382000000000001,0.11609]
[18.75,1,177.28,3.9359999999999999E-2,-0.65600000000000003,68.111000000000004,0.13422000000000001,-1.4510000000000001,21.422000000000001,0.11605]
[18.832999999999998,1,177.28,3.9359999999999999E-2,-0.66200000000000003,68.229799999999997,0.13392000000000001,-1.4470000000000001,21.460999999999999,0.11602]
[18.917000000000002,1,177.28,3.9359999999999999E-2,-0.66700000000000004,68.343699999999998,0.13363,-1.4430000000000001,21.501000000000001,0.11598]
[19,1,177.28,3.9350000000000003E-2,-0.67100000000000004,68.453999999999994,0.13335,-1.4390000000000001,21.54,0.11594]
[19.082999999999998,1,177.29,3.9350000000000003E-2,-0.67600000000000005,68.5595,0.1331,-1.4350000000000001,21.577999999999999,0.11591]
[19.167000000000002,1,177.29,3.934E-2,-0.68,68.661299999999997,0.13284000000000001,-1.431,21.617000000000001,0.11587]
[19.25,1,177.29,3.934E-2,-0.68500000000000005,68.760000000000005,0.13261000000000001,-1.427,21.655000000000001,0.11583]
[19.332999999999998,1,177.3,3.934E-2,-0.68899999999999995,68.855500000000006,0.13239000000000001,-1.423,21.693000000000001,0.1158]
[19.417000000000002,1,177.3,3.934E-2,-0.69299999999999995,68.946700000000007,0.13217000000000001,-1.419,21.73,0.11576]
[19.5,1,177.3,3.934E-2,-0.69699999999999995,69.036000000000001,0.13197,-1.415,21.768000000000001,0.11572]
[19.582999999999998,1,177.3,3.9329999999999997E-2,-0.7,69.122299999999996,0.13177,-1.4119999999999999,21.805,0.11569]
[19.667000000000002,1,177.3,3.9329999999999997E-2,-0.70399999999999996,69.206699999999998,0.13158,-1.4079999999999999,21.841999999999999,0.11565]
[19.75,1,177.31,3.9320000000000001E-2,-0.70799999999999996,69.289000000000001,0.13139000000000001,-1.4039999999999999,21.878,0.11561]
[19.832999999999998,1,177.32,3.9309999999999998E-2,-0.71099999999999997,69.369299999999996,0.13122,-1.4,21.914000000000001,0.11558]
[19.917000000000002,1,177.33,3.9300000000000002E-2,-0.71399999999999997,69.447000000000003,0.13105,-1.3959999999999999,21.951000000000001,0.11554]
[20,1,177.34,3.9289999999999999E-2,-0.71799999999999997,69.524000000000001,0.13088,-1.3919999999999999,21.986000000000001,0.11551]
[20.082999999999998,1,177.36,3.9269999999999999E-2,-0.72099999999999997,69.598699999999994,0.13070999999999999,-1.3879999999999999,22.021999999999998,0.11547]
[20.167000000000002,1,177.37,3.925E-2,-0.72399999999999998,69.671999999999997,0.13056000000000001,-1.385,22.058,0.11543]
[20.25,1,177.39,3.9239999999999997E-2,-0.72699999999999998,69.744,0.13039999999999999,-1.381,22.093,0.1154]
[20.332999999999998,1,177.41,3.9219999999999998E-2,-0.73,69.814899999999994,0.13025,-1.377,22.128,0.11537]
[20.417000000000002,1,177.43,3.9199999999999999E-2,-0.73299999999999998,69.884399999999999,0.13009999999999999,-1.373,22.161999999999999,0.11533]
[20.5,1,177.44,3.918E-2,-0.73599999999999999,69.951999999999998,0.12995999999999999,-1.369,22.196999999999999,0.1153]
[20.582999999999998,1,177.46,3.9149999999999997E-2,-0.73899999999999999,70.019599999999997,0.12981999999999999,-1.3660000000000001,22.231000000000002,0.11526]
[20.667000000000002,1,177.49,3.9129999999999998E-2,-0.74099999999999999,70.085099999999997,0.12967999999999999,-1.3620000000000001,22.265999999999998,0.11523]
[20.75,1,177.5,3.9109999999999999E-2,-0.74399999999999999,70.150000000000006,0.12955,-1.3580000000000001,22.298999999999999,0.11519]
[20.832999999999998,1,177.52,3.909E-2,-0.747,70.212699999999998,0.12941,-1.3540000000000001,22.332999999999998,0.11516]
[20.917000000000002,1,177.55,3.9070000000000001E-2,-0.749,70.274699999999996,0.12928999999999999,-1.351,22.367000000000001,0.11513]
[21,1,177.57,3.9039999999999998E-2,-0.752,70.335999999999999,0.12916,-1.347,22.4,0.11509]
[21.082999999999998,1,177.59,3.9019999999999999E-2,-0.755,70.395700000000005,0.12903999999999999,-1.343,22.433,0.11506]
[21.167000000000002,1,177.61,3.9E-2,-0.75700000000000001,70.454700000000003,0.12892000000000001,-1.34,22.466999999999999,0.11502999999999999]
[21.25,1,177.63,3.8969999999999998E-2,-0.75900000000000001,70.512,0.1288,-1.3360000000000001,22.498999999999999,0.11498999999999999]
[21.332999999999998,1,177.66,3.8949999999999999E-2,-0.76200000000000001,70.569199999999995,0.12869,-1.3320000000000001,22.532,0.11496000000000001]
[21.417000000000002,1,177.68,3.8920000000000003E-2,-0.76400000000000001,70.623599999999996,0.12856999999999999,-1.329,22.565000000000001,0.11493]
[21.5,1,177.7,3.8899999999999997E-2,-0.76600000000000001,70.678100000000001,0.12847,-1.325,22.597000000000001,0.11489000000000001]
[21.582999999999998,1,177.73,3.8870000000000002E-2,-0.76900000000000002,70.731399999999994,0.12836,-1.3220000000000001,22.629000000000001,0.11487]
[21.667000000000002,1,177.75,3.884E-2,-0.77100000000000002,70.783799999999999,0.12825,-1.3180000000000001,22.661999999999999,0.11483]
[21.75,1,177.77,3.882E-2,-0.77300000000000002,70.834000000000003,0.12814999999999999,-1.3140000000000001,22.693000000000001,0.1148]
[21.832999999999998,1,177.8,3.8789999999999998E-2,-0.77500000000000002,70.883799999999994,0.12806000000000001,-1.3109999999999999,22.725000000000001,0.11477]
[21.917000000000002,1,177.82,3.8760000000000003E-2,-0.77700000000000002,70.933400000000006,0.12795999999999999,-1.3069999999999999,22.757000000000001,0.11473999999999999]
[22,1,177.85,3.8730000000000001E-2,-0.77900000000000003,70.981999999999999,0.12786,-1.304,22.788,0.11471000000000001]
[22.082999999999998,1,177.88,3.8710000000000001E-2,-0.78100000000000003,71.029700000000005,0.12776000000000001,-1.3,22.82,0.11468]
[22.167000000000002,1,177.91,3.8670000000000003E-2,-0.78300000000000003,71.077299999999994,0.12767000000000001,-1.2969999999999999,22.850999999999999,0.11464000000000001]
[22.25,1,177.94,3.8640000000000001E-2,-0.78500000000000003,71.123999999999995,0.12758,-1.2929999999999999,22.882000000000001,0.11461]
[22.332999999999998,1,177.97,3.8609999999999998E-2,-0.78700000000000003,71.171400000000006,0.12748999999999999,-1.29,22.913,0.11458]
[22.417000000000002,1,178,3.8580000000000003E-2,-0.78900000000000003,71.217600000000004,0.12739,-1.286,22.945,0.11455]
[22.5,1,178.03,3.8539999999999998E-2,-0.79100000000000004,71.264499999999998,0.1273,-1.2829999999999999,22.975000000000001,0.11452]
[22.582999999999998,1,178.06,3.8510000000000003E-2,-0.79300000000000004,71.311000000000007,0.12720999999999999,-1.2789999999999999,23.004999999999999,0.11448999999999999]
[22.667000000000002,1,178.09,3.8469999999999997E-2,-0.79500000000000004,71.357299999999995,0.12711,-1.276,23.036000000000001,0.11446000000000001]
[22.75,1,178.13,3.8429999999999999E-2,-0.79700000000000004,71.403999999999996,0.12701999999999999,-1.272,23.067,0.11443]
[22.832999999999998,1,178.16,3.8399999999999997E-2,-0.79900000000000004,71.450199999999995,0.12692999999999999,-1.2689999999999999,23.097000000000001,0.1144]
[22.917000000000002,1,178.2,3.8359999999999998E-2,-0.8,71.496399999999994,0.12684000000000001,-1.266,23.126999999999999,0.11437]
[23,1,178.23,3.8330000000000003E-2,-0.80200000000000005,71.537999999999997,0.12676000000000001,-1.2629999999999999,23.154,0.11434]

{"sheet":"LMSDataFemale","index":10,"n_rows":315,"n_cols":13,"rows_kept":315,"cut":false,"hidden":true,"merged":[]}
["Female"]
[]
[]
[null,"Height (HT, cm)",null,null,"Weight (WT, kg)",null,null,"BMI (BMI, kg/m2)",null,null,"OFC"]
["Age"]
["(years)","L","M","S","L","M","S","L","M","S","L","M","S"]
[-0.32580424366872007,null,null,null,1.3260000000000001,0.55889999999999995,0.17377999999999999,null,null,null,1,21.101559999999999,6.6295300000000001E-2]
[-0.30663928815879532,null,null,null,1.278,0.65839999999999999,0.17716000000000001,null,null,null,1,22.168089999999999,6.4821619999999996E-2]
[-0.28747433264887062,1,34.595440000000004,8.0860440000000006E-2,1.2290000000000001,0.7611,0.18065999999999999,null,null,null,1,23.23329,6.3313949999999994E-2]
[-0.26830937713894593,1,35.597709999999999,7.735533E-2,1.181,0.86720000000000008,0.18429000000000001,null,null,null,1,24.290140000000001,6.1736390000000002E-2]
[-0.24914442162902123,1,36.609050000000003,7.3865970000000003E-2,1.1319999999999999,0.97750000000000004,0.18779000000000001,null,null,null,1,25.32564,6.0077279999999997E-2]
[-0.2299794661190965,1,37.658320000000003,7.0423669999999994E-2,1.0840000000000001,1.0929,0.19058,null,null,null,1,26.316020000000002,5.8353889999999999E-2]
[-0.21081451060917181,1,38.769869999999997,6.7018910000000001E-2,1.0349999999999999,1.2165999999999999,0.19209000000000001,null,null,null,1,27.25686,5.6500729999999999E-2]
[-0.19164955509924708,1,39.94117,6.3626740000000001E-2,0.98699999999999999,1.3593,0.19212000000000001,null,null,null,1,28.15286,5.4430449999999998E-2]
[-0.17248459958932238,1,41.141539999999999,6.0254309999999998E-2,0.93799999999999994,1.5249999999999999,0.19051999999999999,null,null,null,1,29.009239999999998,5.2120060000000003E-2]
[-0.15331964407939766,1,42.347250000000003,5.6938700000000002E-2,0.89,1.7118,0.18729999999999999,null,null,null,1,29.817119999999999,4.9565860000000003E-2]
[-0.13415468856947296,1,43.537999999999997,5.372271E-2,0.84099999999999997,1.9162999999999999,0.18260999999999999,null,null,null,1,30.568069999999999,4.6876130000000002E-2]
[-0.11498973305954825,1,44.69314,5.0646339999999998E-2,0.79300000000000004,2.1341999999999999,0.17659,null,null,null,1,31.259039999999999,4.4157549999999997E-2]
[-9.5824777549623541E-2,1,45.790790000000001,4.7736279999999999E-2,0.74399999999999999,2.3607,0.1694,null,null,null,1,31.885339999999999,4.1502120000000003E-2]
[-7.665982203969883E-2,1,46.81071,4.5006350000000001E-2,0.69499999999999995,2.5903,0.16106999999999999,null,null,null,1,32.445340000000002,3.8976619999999997E-2]
[-5.7494866529774126E-2,1,47.739719999999998,4.2487539999999997E-2,0.64700000000000002,2.8164000000000002,0.15165000000000001,null,null,null,1,32.942059999999998,3.6619359999999997E-2]
[-3.8329911019849415E-2,1,48.577710000000003,4.0264479999999998E-2,0.59799999999999998,3.0333999999999999,0.14174,null,null,null,1,33.381239999999998,3.44432E-2]
[-1.9164955509924708E-2,1,49.339619999999996,3.8397779999999999E-2,0.55000000000000004,3.2361999999999997,0.13249,null,null,null,1,33.774639999999998,3.2429380000000001E-2]
[0,1,50.017189999999999,3.6967399999999997E-2,0.501,3.4129999999999998,0.12481,null,null,null,1,34.130420000000001,3.0557609999999999E-2]
[3.8329911019849415E-2,1,50,3.9899999999999998E-2,1,3.36,0.14080000000000001,null,null,null,1,34,3.3399999999999999E-2]
[3.8329911019849415E-2,1,51.512,3.6940000000000001E-2,0.23039999999999999,3.5693000000000001,0.14338999999999999,0.50819999999999999,13.450100000000001,9.7409999999999997E-2,1,35.227200000000003,3.2509999999999997E-2]
[5.7494866529774126E-2,1,52.469499999999996,3.669E-2,0.2024,3.8351999999999999,0.1406,0.42630000000000001,13.9505,9.647E-2,1,35.843000000000004,3.2309999999999998E-2]
[7.665982203969883E-2,1,53.380899999999997,3.6470000000000002E-2,0.1789,4.0987,0.13805000000000001,0.36370000000000002,14.4208,9.5769999999999994E-2,1,36.376100000000001,3.2149999999999998E-2]
[8.3333333333333329E-2,1,53.687199999999997,3.6400000000000002E-2,0.1714,4.1872999999999996,0.13724,0.3448,14.5679,9.5560000000000006E-2,1,36.546300000000002,3.2099999999999997E-2]
[9.5824777549623541E-2,1,54.245399999999997,3.6269999999999997E-2,0.15820000000000001,4.3475999999999999,0.13583000000000001,0.31240000000000001,14.8157,9.5200000000000007E-2,1,36.847200000000001,3.202E-2]
[0.11498973305954825,1,55.0642,3.6089999999999997E-2,0.13950000000000001,4.5792999999999999,0.13392000000000001,0.26879999999999998,15.138,9.4719999999999999E-2,1,37.271099999999997,3.1910000000000001E-2]
[0.13415468856947296,1,55.840600000000002,3.5929999999999997E-2,0.12239999999999999,4.7949999999999999,0.13228000000000001,0.2306,15.4063,9.4310000000000005E-2,1,37.6584,3.1820000000000001E-2]
[0.15331964407939766,1,56.576700000000002,3.5779999999999999E-2,0.1065,4.9958999999999998,0.13086999999999999,0.1966,15.6311,9.3939999999999996E-2,1,38.0167,3.1730000000000001E-2]
[0.16666666666666666,1,57.067300000000003,3.5680000000000003E-2,9.6199999999999994E-2,5.1281999999999996,0.13,0.1749,15.767899999999999,9.3710000000000002E-2,1,38.252099999999999,3.168E-2]
[0.17248459958932238,1,57.2761,3.5639999999999998E-2,9.1800000000000007E-2,5.1841999999999997,0.12966,0.1658,15.8232,9.3609999999999999E-2,1,38.351599999999998,3.1660000000000001E-2]
[0.19164955509924708,1,57.943600000000004,3.5520000000000003E-2,7.7899999999999997E-2,5.3617999999999997,0.12861,0.13769999999999999,15.987399999999999,9.332E-2,1,38.667299999999997,3.1579999999999997E-2]
[0.21081451060917181,1,58.581600000000002,3.5400000000000001E-2,6.4799999999999996E-2,5.5294999999999996,0.12770000000000001,0.1118,16.127700000000001,9.3039999999999998E-2,1,38.966099999999997,3.1519999999999999E-2]
[0.2299794661190965,1,59.1922,3.5299999999999998E-2,5.2499999999999998E-2,5.6882999999999999,0.12691,8.77E-2,16.2485,9.2789999999999997E-2,1,39.250100000000003,3.1460000000000002E-2]
[0.24914442162902123,1,59.777299999999997,3.5200000000000002E-2,4.07E-2,5.8392999999999997,0.12622,6.5199999999999994E-2,16.353100000000001,9.2549999999999993E-2,1,39.521000000000001,3.1399999999999997E-2]
[0.25,1,59.802900000000001,3.5200000000000002E-2,4.02E-2,5.8457999999999997,0.12619,6.4299999999999996E-2,16.357399999999998,9.2539999999999997E-2,1,39.532800000000002,3.1399999999999997E-2]
[0.33333333333333331,1,62.0899,3.4860000000000002E-2,-5.0000000000000001E-3,6.4237000000000002,0.12402000000000001,-1.9099999999999999E-2,16.670300000000001,9.1660000000000005E-2,1,40.581699999999998,3.1189999999999999E-2]
[0.41666666666666669,1,64.030100000000004,3.4630000000000001E-2,-4.2999999999999997E-2,6.8985000000000003,0.12274,-8.6400000000000005E-2,16.8386,9.0959999999999999E-2,1,41.459000000000003,3.1019999999999999E-2]
[0.5,1,65.731099999999998,3.4479999999999997E-2,-7.5600000000000001E-2,7.2969999999999997,0.12204,-0.1429,16.908300000000001,9.0359999999999996E-2,1,42.1995,3.0870000000000002E-2]
[0.58333333333333337,1,67.287300000000002,3.4410000000000003E-2,-0.10390000000000001,7.6421999999999999,0.12178,-0.19159999999999999,16.902000000000001,8.9840000000000003E-2,1,42.829000000000001,3.075E-2]
[0.66666666666666663,1,68.749799999999993,3.44E-2,-0.1288,7.9486999999999997,0.12181,-0.2344,16.840399999999999,8.9389999999999997E-2,1,43.367100000000001,3.0630000000000001E-2]
[0.75,1,70.143500000000003,3.4439999999999998E-2,-0.1507,8.2254000000000005,0.12199,-0.27250000000000002,16.740600000000001,8.8980000000000004E-2,1,43.83,3.0530000000000002E-2]
[0.83333333333333337,1,71.481800000000007,3.4520000000000002E-2,-0.17,8.48,0.12223000000000001,-0.30680000000000002,16.618400000000001,8.8609999999999994E-2,1,44.231900000000003,3.0439999999999998E-2]
[0.91666666666666663,1,72.771000000000001,3.4639999999999997E-2,-0.18720000000000001,8.7192000000000007,0.12247,-0.33810000000000001,16.487500000000001,8.8279999999999997E-2,1,44.584400000000002,3.0349999999999999E-2]
[1,1,74.015000000000001,3.4790000000000001E-2,-0.2024,8.9481000000000002,0.12268,-0.36670000000000003,16.3568,8.7970000000000007E-2,1,44.896500000000003,3.0269999999999998E-2]
[1.0833333333333333,1,75.217600000000004,3.4959999999999998E-2,-0.21579999999999999,9.1699000000000002,0.12282999999999999,-0.39319999999999999,16.231100000000001,8.7679999999999994E-2,1,45.175199999999997,3.0190000000000002E-2]
[1.1666666666666667,1,76.381699999999995,3.5139999999999998E-2,-0.2278,9.3870000000000005,0.12293999999999999,-0.41770000000000002,16.1128,8.7410000000000002E-2,1,45.426499999999997,3.0120000000000001E-2]
[1.25,1,77.509900000000002,3.5340000000000003E-2,-0.2384,9.6007999999999996,0.12299,-0.44069999999999998,16.002800000000001,8.7160000000000001E-2,1,45.655099999999997,3.006E-2]
[1.3333333333333333,1,78.605500000000006,3.5549999999999998E-2,-0.24779999999999999,9.8124000000000002,0.12303,-0.46229999999999999,15.9017,8.6929999999999993E-2,1,45.865000000000002,2.9989999999999999E-2]
[1.4166666666666667,1,79.671000000000006,3.576E-2,-0.25619999999999998,10.022600000000001,0.12306,-0.48249999999999998,15.8096,8.6709999999999995E-2,1,46.059800000000003,2.9929999999999998E-2]
[1.5,1,80.707899999999995,3.5979999999999998E-2,-0.26369999999999999,10.2315,0.12309,-0.50170000000000003,15.7263,8.6499999999999994E-2,1,46.242400000000004,2.9870000000000001E-2]
[1.5833333333333333,1,81.718199999999996,3.6200000000000003E-2,-0.27029999999999998,10.439299999999999,0.12315,-0.51990000000000003,15.6517,8.6300000000000002E-2,1,46.415199999999999,2.9819999999999999E-2]
[1.6666666666666667,1,82.703599999999994,3.6429999999999997E-2,-0.2762,10.6464,0.12323000000000001,-0.53720000000000001,15.5855,8.6120000000000002E-2,1,46.580100000000002,2.9770000000000001E-2]
[1.75,1,83.665400000000005,3.6659999999999998E-2,-0.28149999999999997,10.853400000000001,0.12335,-0.55369999999999997,15.527799999999999,8.5940000000000003E-2,1,46.738399999999999,2.972E-2]
[1.8333333333333333,1,84.603999999999999,3.6880000000000003E-2,-0.28620000000000001,11.0608,0.1235,-0.56950000000000001,15.4787,8.5769999999999999E-2,1,46.891300000000001,2.9669999999999998E-2]
[1.9166666666666667,1,85.520200000000003,3.7109999999999997E-2,-0.2903,11.268800000000001,0.12368999999999999,-0.58460000000000001,15.438000000000001,8.5599999999999996E-2,1,47.039099999999998,2.962E-2]
[2,1,86.415300000000002,3.7339999999999998E-2,-0.29409999999999997,11.477499999999999,0.1239,-0.59889999999999999,15.405200000000001,8.5449999999999998E-2,1,47.182200000000002,2.9569999999999999E-2]
[2,1,85.715299999999999,3.764E-2,-0.29409999999999997,11.477499999999999,0.1239,-0.56840000000000002,15.6881,8.4540000000000004E-2,1,47.182200000000002,2.9569999999999999E-2]
[2.0833333333333335,1,86.590400000000002,3.7859999999999998E-2,-0.29749999999999999,11.686400000000001,0.12414,-0.56840000000000002,15.659000000000001,8.4519999999999998E-2,1,47.320399999999999,2.9530000000000001E-2]
[2.1666666666666665,1,87.446200000000005,3.8080000000000003E-2,-0.30049999999999999,11.8947,0.12441000000000001,-0.56840000000000002,15.630800000000001,8.4489999999999996E-2,1,47.453600000000002,2.9489999999999999E-2]
[2.25,1,88.283000000000001,3.8300000000000001E-2,-0.30320000000000003,12.1015,0.12472,-0.56840000000000002,15.6037,8.4459999999999993E-2,1,47.581699999999998,2.945E-2]
[2.3333333333333335,1,89.100399999999993,3.8510000000000003E-2,-0.30570000000000003,12.305899999999999,0.12506,-0.56840000000000002,15.5777,8.4440000000000001E-2,1,47.704500000000003,2.9409999999999999E-2]
[2.4166666666666665,1,89.899100000000004,3.8719999999999997E-2,-0.308,12.507300000000001,0.12545000000000001,-0.56840000000000002,15.552300000000001,8.4430000000000005E-2,1,47.821899999999999,2.937E-2]
[2.5,1,90.679699999999997,3.8929999999999999E-2,-0.31009999999999999,12.705500000000001,0.12587000000000001,-0.56840000000000002,15.5276,8.4440000000000001E-2,1,47.933999999999997,2.9329999999999998E-2]
[2.5833333333333335,1,91.442999999999998,3.9129999999999998E-2,-0.312,12.900600000000001,0.12633,-0.56840000000000002,15.503399999999999,8.448E-2,1,48.040999999999997,2.929E-2]
[2.6666666666666665,1,92.190600000000003,3.9329999999999997E-2,-0.31380000000000002,13.093,0.12683,-0.56840000000000002,15.479799999999999,8.455E-2,1,48.1432,2.9260000000000001E-2]
[2.75,1,92.923900000000003,3.952E-2,-0.3155,13.2837,0.12737000000000001,-0.56840000000000002,15.4572,8.4669999999999995E-2,1,48.2408,2.9219999999999999E-2]
[2.8333333333333335,1,93.644400000000005,3.9710000000000002E-2,-0.31709999999999999,13.473100000000001,0.12794,-0.56840000000000002,15.435600000000001,8.4839999999999999E-2,1,48.334299999999999,2.9190000000000001E-2]
[2.9166666666666665,1,94.353300000000004,3.9890000000000002E-2,-0.31859999999999999,13.661799999999999,0.12855,-0.56840000000000002,15.4155,8.5059999999999997E-2,1,48.423900000000003,2.9149999999999999E-2]
[3,1,95.051500000000004,4.0059999999999998E-2,-0.3201,13.850300000000001,0.12919,-0.56840000000000002,15.396800000000001,8.5349999999999995E-2,1,48.509900000000002,2.912E-2]
[3.0833333333333335,1,95.739900000000006,4.0239999999999998E-2,-0.3216,14.038500000000001,0.12988,-0.56840000000000002,15.3796,8.5690000000000002E-2,1,48.592599999999997,2.9090000000000001E-2]
[3.1666666666666665,1,96.418700000000001,4.0410000000000001E-2,-0.32300000000000001,14.2265,0.13059000000000001,-0.56840000000000002,15.363799999999999,8.609E-2,1,48.672199999999997,2.9059999999999999E-2]
[3.25,1,97.088499999999996,4.0570000000000002E-2,-0.32429999999999998,14.414,0.13134999999999999,-0.56840000000000002,15.349299999999999,8.6540000000000006E-2,1,48.748899999999999,2.903E-2]
[3.3333333333333335,1,97.749300000000005,4.0730000000000002E-2,-0.32569999999999999,14.601000000000001,0.13213,-0.56840000000000002,15.335800000000001,8.7040000000000006E-2,1,48.822800000000001,2.9000000000000001E-2]
[3.4166666666666665,1,98.401499999999999,4.0890000000000003E-2,-0.32700000000000001,14.7873,0.13292999999999999,-0.56840000000000002,15.3233,8.7569999999999995E-2,1,48.894100000000002,2.8969999999999999E-2]
[3.5,1,99.044799999999995,4.1050000000000003E-2,-0.32829999999999998,14.9727,0.13375999999999999,-0.56840000000000002,15.3116,8.813E-2,1,48.962899999999998,2.894E-2]
[3.5833333333333335,1,99.679500000000004,4.1200000000000001E-2,-0.3296,15.157299999999999,0.1346,-0.56840000000000002,15.300700000000001,8.8719999999999993E-2,1,49.029400000000003,2.8910000000000002E-2]
[3.6666666666666665,1,100.3058,4.1349999999999998E-2,-0.33090000000000003,15.340999999999999,0.13544999999999999,-0.56840000000000002,15.2905,8.931E-2,1,49.093699999999998,2.8879999999999999E-2]
[3.75,1,100.9238,4.1500000000000002E-2,-0.3322,15.523999999999999,0.1363,-0.56840000000000002,15.2814,8.9910000000000004E-2,1,49.155999999999999,2.886E-2]
[3.8333333333333335,1,101.5337,4.1640000000000003E-2,-0.33350000000000002,15.7064,0.13716,-0.56840000000000002,15.273199999999999,9.0509999999999993E-2,1,49.2164,2.8830000000000001E-2]
[3.9166666666666665,1,102.136,4.1790000000000001E-2,-0.33479999999999999,15.888199999999999,0.13800000000000001,-0.56840000000000002,15.2661,9.11E-2,1,49.275100000000002,2.8799999999999999E-2]
[4,1,102.7312,4.1930000000000002E-2,-0.33610000000000001,16.069700000000001,0.13883999999999999,-0.56840000000000002,15.260199999999999,9.1679999999999998E-2,1,49.332099999999997,2.878E-2]
[4,1,101.54,3.9669999999999997E-2,-0.51600000000000001,16.198,0.1244,-1.151,15.656000000000001,8.7279999999999996E-2,1,51.103999999999999,2.342E-2]
[4.0830000000000002,1,102.12,3.9789999999999999E-2,-0.52400000000000002,16.366099999999999,0.12512000000000001,-1.157,15.638999999999999,8.77E-2,1,51.155999999999999,2.3390000000000001E-2]
[4.1669999999999998,1,102.71,3.9919999999999997E-2,-0.53200000000000003,16.535900000000002,0.12584000000000001,-1.163,15.622,8.8139999999999996E-2,1,51.207999999999998,2.3359999999999999E-2]
[4.25,1,103.31,4.0039999999999999E-2,-0.53900000000000003,16.706,0.12656999999999999,-1.169,15.605,8.8599999999999998E-2,1,51.258000000000003,2.332E-2]
[4.3330000000000002,1,103.91,4.0160000000000001E-2,-0.54700000000000004,16.8781,0.12731000000000001,-1.175,15.589,8.906E-2,1,51.308999999999997,2.3290000000000002E-2]
[4.4169999999999998,1,104.53,4.0280000000000003E-2,-0.55500000000000005,17.0519,0.12806000000000001,-1.181,15.573,8.9539999999999995E-2,1,51.357999999999997,2.3259999999999999E-2]
[4.5,1,105.15,4.0410000000000001E-2,-0.56299999999999994,17.227,0.12881000000000001,-1.1870000000000001,15.557,9.0039999999999995E-2,1,51.405999999999999,2.3230000000000001E-2]
[4.5830000000000002,1,105.77,4.0529999999999997E-2,-0.56999999999999995,17.4041,0.12956999999999999,-1.1930000000000001,15.542,9.0539999999999995E-2,1,51.454000000000001,2.3210000000000001E-2]
[4.6669999999999998,1,106.4,4.0649999999999999E-2,-0.57799999999999996,17.581900000000001,0.13033,-1.198,15.528,9.1060000000000002E-2,1,51.500999999999998,2.3179999999999999E-2]
[4.75,1,107.02,4.0770000000000001E-2,-0.58499999999999996,17.760999999999999,0.13109999999999999,-1.204,15.515000000000001,9.1600000000000001E-2,1,51.545999999999999,2.316E-2]
[4.8330000000000002,1,107.64,4.088E-2,-0.59199999999999997,17.940100000000001,0.13186,-1.2090000000000001,15.503,9.214E-2,1,51.591000000000001,2.3140000000000001E-2]
[4.9169999999999998,1,108.26,4.0989999999999999E-2,-0.6,18.119800000000001,0.13264000000000001,-1.2150000000000001,15.492000000000001,9.2700000000000005E-2,1,51.637,2.3109999999999999E-2]
[5,1,108.86,4.1099999999999998E-2,-0.60699999999999998,18.298999999999999,0.13339999999999999,-1.22,15.483000000000001,9.3259999999999996E-2,1,51.680999999999997,2.3089999999999999E-2]
[5.0830000000000002,1,109.45,4.1200000000000001E-2,-0.61399999999999999,18.479099999999999,0.13416,-1.2250000000000001,15.475,9.3840000000000007E-2,1,51.725000000000001,2.307E-2]
[5.1669999999999998,1,110.03,4.1300000000000003E-2,-0.621,18.658100000000001,0.13492999999999999,-1.2310000000000001,15.468,9.443E-2,1,51.768000000000001,2.3060000000000001E-2]
[5.25,1,110.6,4.1399999999999999E-2,-0.627,18.837,0.13569000000000001,-1.236,15.462999999999999,9.5030000000000003E-2,1,51.81,2.3040000000000001E-2]
[5.3330000000000002,1,111.16,4.1489999999999999E-2,-0.63400000000000001,19.016999999999999,0.13643,-1.2410000000000001,15.46,9.5630000000000007E-2,1,51.851999999999997,2.3029999999999998E-2]
[5.4169999999999998,1,111.71,4.1570000000000003E-2,-0.64,19.1967,0.13719000000000001,-1.2450000000000001,15.457000000000001,9.6240000000000006E-2,1,51.893000000000001,2.3009999999999999E-2]
[5.5,1,112.24,4.165E-2,-0.64700000000000002,19.376999999999999,0.13794000000000001,-1.25,15.457000000000001,9.6860000000000002E-2,1,51.933999999999997,2.3E-2]
[5.5830000000000002,1,112.77,4.1730000000000003E-2,-0.65300000000000002,19.5581,0.13868,-1.2549999999999999,15.458,9.7489999999999993E-2,1,51.975000000000001,2.299E-2]
[5.6669999999999998,1,113.29,4.1799999999999997E-2,-0.65900000000000003,19.740400000000001,0.13941999999999999,-1.26,15.461,9.8119999999999999E-2,1,52.014000000000003,2.298E-2]
[5.75,1,113.81,4.1869999999999997E-2,-0.66500000000000004,19.925000000000001,0.14016000000000001,-1.264,15.465,9.8750000000000004E-2,1,52.052999999999997,2.2970000000000001E-2]
[5.8330000000000002,1,114.32,4.1939999999999998E-2,-0.67200000000000004,20.11,0.1409,-1.2689999999999999,15.47,9.9400000000000002E-2,1,52.091999999999999,2.2960000000000001E-2]
[5.9169999999999998,1,114.82,4.2000000000000003E-2,-0.67800000000000005,20.2972,0.14165,-1.2729999999999999,15.477,0.10004,1,52.131,2.2950000000000002E-2]
[6,1,115.33,4.206E-2,-0.68400000000000005,20.486000000000001,0.14238999999999999,-1.2769999999999999,15.484999999999999,0.10069,1,52.168999999999997,2.2939999999999999E-2]
[6.0830000000000002,1,115.83,4.2119999999999998E-2,-0.68899999999999995,20.677800000000001,0.14315,-1.2809999999999999,15.494,0.10135,1,52.207000000000001,2.2939999999999999E-2]
[6.1669999999999998,1,116.33,4.2169999999999999E-2,-0.69499999999999995,20.870999999999999,0.14391000000000001,-1.286,15.506,0.10199999999999999,1,52.244,2.2929999999999999E-2]
[6.25,1,116.82,4.2220000000000001E-2,-0.70099999999999996,21.065999999999999,0.14468,-1.2889999999999999,15.516999999999999,0.10266,1,52.280999999999999,2.2929999999999999E-2]
[6.3330000000000002,1,117.31,4.2270000000000002E-2,-0.70699999999999996,21.262899999999998,0.14546999999999999,-1.2929999999999999,15.53,0.10332,1,52.317999999999998,2.2929999999999999E-2]
[6.4169999999999998,1,117.81,4.2320000000000003E-2,-0.71199999999999997,21.4633,0.14626,-1.2969999999999999,15.544,0.10397000000000001,1,52.354999999999997,2.2929999999999999E-2]
[6.5,1,118.3,4.2369999999999998E-2,-0.71799999999999997,21.667000000000002,0.14706,-1.3009999999999999,15.56,0.10463,1,52.390999999999998,2.2919999999999999E-2]
[6.5830000000000002,1,118.79,4.2410000000000003E-2,-0.72299999999999998,21.874199999999998,0.14788000000000001,-1.304,15.577,0.10528999999999999,1,52.427,2.2919999999999999E-2]
[6.6669999999999998,1,119.28,4.2459999999999998E-2,-0.72899999999999998,22.085999999999999,0.14871999999999999,-1.3080000000000001,15.596,0.10595,1,52.462000000000003,2.2919999999999999E-2]
[6.75,1,119.77,4.2500000000000003E-2,-0.73399999999999999,22.302,0.14957999999999999,-1.3109999999999999,15.614000000000001,0.1066,1,52.497999999999998,2.2929999999999999E-2]
[6.8330000000000002,1,120.26,4.2540000000000001E-2,-0.73899999999999999,22.523399999999999,0.15045,-1.3140000000000001,15.635,0.10725,1,52.533000000000001,2.2929999999999999E-2]
[6.9169999999999998,1,120.77,4.258E-2,-0.74399999999999999,22.748999999999999,0.15134,-1.3169999999999999,15.656000000000001,0.10789,1,52.567999999999998,2.2929999999999999E-2]
[7,1,121.27,4.2610000000000002E-2,-0.749,22.98,0.15225,-1.32,15.677,0.10854,1,52.603999999999999,2.2929999999999999E-2]
[7.0830000000000002,1,121.77,4.265E-2,-0.754,23.214099999999998,0.15317,-1.323,15.7,0.10918,1,52.637999999999998,2.2939999999999999E-2]
[7.1669999999999998,1,122.28,4.2680000000000003E-2,-0.75800000000000001,23.451699999999999,0.15409,-1.325,15.723000000000001,0.10981,1,52.673000000000002,2.2939999999999999E-2]
[7.25,1,122.79,4.2709999999999998E-2,-0.76200000000000001,23.690999999999999,0.155,-1.3280000000000001,15.747999999999999,0.11044,1,52.707000000000001,2.2950000000000002E-2]
[7.3330000000000002,1,123.31,4.2729999999999997E-2,-0.76600000000000001,23.933,0.15590999999999999,-1.33,15.772,0.11106000000000001,1,52.741,2.2960000000000001E-2]
[7.4169999999999998,1,123.82,4.2759999999999999E-2,-0.77,24.175599999999999,0.15681999999999999,-1.3320000000000001,15.798,0.11167000000000001,1,52.774999999999999,2.2960000000000001E-2]
[7.5,1,124.33,4.2779999999999999E-2,-0.77400000000000002,24.419,0.15772,-1.3340000000000001,15.824,0.11228,1,52.808999999999997,2.2970000000000001E-2]
[7.5830000000000002,1,124.84,4.2810000000000001E-2,-0.77700000000000002,24.662500000000001,0.15859999999999999,-1.3360000000000001,15.85,0.11287999999999999,1,52.841999999999999,2.298E-2]
[7.6669999999999998,1,125.34,4.2840000000000003E-2,-0.78,24.907,0.15947,-1.3380000000000001,15.877000000000001,0.11346000000000001,1,52.875999999999998,2.299E-2]
[7.75,1,125.85,4.2869999999999998E-2,-0.78300000000000003,25.152999999999999,0.16033,-1.339,15.904999999999999,0.11404,1,52.908999999999999,2.3E-2]
[7.8330000000000002,1,126.35,4.2900000000000001E-2,-0.78500000000000003,25.398,0.16117000000000001,-1.341,15.933999999999999,0.11461,1,52.942,2.3009999999999999E-2]
[7.9169999999999998,1,126.85,4.2930000000000003E-2,-0.78700000000000003,25.6434,0.16200999999999999,-1.3420000000000001,15.962999999999999,0.11516999999999999,1,52.975000000000001,2.3019999999999999E-2]
[8,1,127.34,4.2979999999999997E-2,-0.78900000000000003,25.888999999999999,0.16281999999999999,-1.3440000000000001,15.993,0.11572,1,53.008000000000003,2.3029999999999998E-2]
[8.0830000000000002,1,127.82,4.3020000000000003E-2,-0.79,26.133500000000002,0.16363,-1.345,16.021999999999998,0.11625000000000001,1,53.040999999999997,2.3040000000000001E-2]
[8.1669999999999998,1,128.30000000000001,4.308E-2,-0.79200000000000004,26.378,0.16442999999999999,-1.345,16.053999999999998,0.11679,1,53.073,2.3050000000000001E-2]
[8.25,1,128.76,4.3139999999999998E-2,-0.79200000000000004,26.622,0.16521,-1.3460000000000001,16.085000000000001,0.1173,1,53.106000000000002,2.3060000000000001E-2]
[8.3330000000000002,1,129.22999999999999,4.3209999999999998E-2,-0.79300000000000004,26.8659,0.16599,-1.347,16.117999999999999,0.1178,1,53.137999999999998,2.308E-2]
[8.4169999999999998,1,129.69,4.3279999999999999E-2,-0.79300000000000004,27.110499999999998,0.16677,-1.347,16.149999999999999,0.1183,1,53.168999999999997,2.3089999999999999E-2]
[8.5,1,130.13999999999999,4.3360000000000003E-2,-0.79300000000000004,27.355,0.16753999999999999,-1.3480000000000001,16.184000000000001,0.11879000000000001,1,53.201000000000001,2.3099999999999999E-2]
[8.5830000000000002,1,130.59,4.3450000000000003E-2,-0.79300000000000004,27.601099999999999,0.16832,-1.3480000000000001,16.218,0.11926,1,53.231999999999999,2.3120000000000002E-2]
[8.6669999999999998,1,131.03,4.3540000000000002E-2,-0.79200000000000004,27.85,0.16908999999999999,-1.3480000000000001,16.253,0.11971999999999999,1,53.264000000000003,2.3130000000000001E-2]
[8.75,1,131.47999999999999,4.3639999999999998E-2,-0.79100000000000004,28.100999999999999,0.16986999999999999,-1.349,16.288,0.12017,1,53.295000000000002,2.315E-2]
[8.8330000000000002,1,131.91999999999999,4.3749999999999997E-2,-0.78900000000000003,28.3567,0.17063999999999999,-1.349,16.324000000000002,0.1206,1,53.326000000000001,2.316E-2]
[8.9169999999999998,1,132.37,4.3869999999999999E-2,-0.78700000000000003,28.6159,0.17141000000000001,-1.3480000000000001,16.361000000000001,0.12103,1,53.356999999999999,2.3179999999999999E-2]
[9,1,132.82,4.3990000000000001E-2,-0.78500000000000003,28.88,0.17218,-1.3480000000000001,16.399000000000001,0.12144000000000001,1,53.387,2.3199999999999998E-2]
[9.0830000000000002,1,133.27000000000001,4.4119999999999999E-2,-0.78200000000000003,29.148099999999999,0.17294000000000001,-1.3480000000000001,16.437000000000001,0.12185,1,53.417000000000002,2.3210000000000001E-2]
[9.1669999999999998,1,133.72999999999999,4.4260000000000001E-2,-0.77900000000000003,29.420300000000001,0.17369000000000001,-1.347,16.475000000000001,0.12223000000000001,1,53.448,2.3230000000000001E-2]
[9.25,1,134.19,4.4400000000000002E-2,-0.77600000000000002,29.696999999999999,0.17444999999999999,-1.347,16.515000000000001,0.12261,1,53.476999999999997,2.325E-2]
[9.3330000000000002,1,134.65,4.4549999999999999E-2,-0.77200000000000002,29.9771,0.17519999999999999,-1.3460000000000001,16.555,0.12298000000000001,1,53.506999999999998,2.3269999999999999E-2]
[9.4169999999999998,1,135.12,4.471E-2,-0.76800000000000002,30.259699999999999,0.17594000000000001,-1.3460000000000001,16.596,0.12333,1,53.536999999999999,2.3279999999999999E-2]
[9.5,1,135.59,4.487E-2,-0.76400000000000001,30.545000000000002,0.17668,-1.345,16.637,0.12367,1,53.566000000000003,2.3300000000000001E-2]
[9.5830000000000002,1,136.06,4.5039999999999997E-2,-0.75800000000000001,30.833500000000001,0.17741999999999999,-1.3440000000000001,16.678999999999998,0.124,1,53.594999999999999,2.332E-2]
[9.6669999999999998,1,136.53,4.521E-2,-0.753,31.124300000000002,0.17816000000000001,-1.343,16.722000000000001,0.12432,1,53.624000000000002,2.334E-2]
[9.75,1,137,4.5379999999999997E-2,-0.747,31.417000000000002,0.17891000000000001,-1.3420000000000001,16.765000000000001,0.12461999999999999,1,53.652999999999999,2.3359999999999999E-2]
[9.8330000000000002,1,137.47999999999999,4.5560000000000003E-2,-0.74,31.712199999999999,0.17967,-1.341,16.809000000000001,0.12492,1,53.680999999999997,2.3380000000000001E-2]
[9.9169999999999998,1,137.94999999999999,4.5740000000000003E-2,-0.73299999999999998,32.009599999999999,0.18043999999999999,-1.34,16.853000000000002,0.12520000000000001,1,53.71,2.3400000000000001E-2]
[10,1,138.43,4.5929999999999999E-2,-0.72499999999999998,32.308,0.18121999999999999,-1.339,16.898,0.12547,1,53.738,2.342E-2]
[10.083,1,138.9,4.6120000000000001E-2,-0.71699999999999997,32.607500000000002,0.18201000000000001,-1.3380000000000001,16.943000000000001,0.12573000000000001,1,53.765999999999998,2.3439999999999999E-2]
[10.167,1,139.38,4.6300000000000001E-2,-0.70799999999999996,32.908299999999997,0.18279999999999999,-1.337,16.989999999999998,0.12598000000000001,1,53.793999999999997,2.3460000000000002E-2]
[10.25,1,139.86000000000001,4.6489999999999997E-2,-0.69899999999999995,33.212000000000003,0.18359,-1.3360000000000001,17.036000000000001,0.12622,1,53.820999999999998,2.3480000000000001E-2]
[10.333,1,140.33000000000001,4.6670000000000003E-2,-0.69,33.514699999999998,0.18437000000000001,-1.3340000000000001,17.082999999999998,0.12644,1,53.847999999999999,2.35E-2]
[10.417,1,140.81,4.6850000000000003E-2,-0.68,33.821300000000001,0.18514,-1.333,17.131,0.12665999999999999,1,53.875,2.3519999999999999E-2]
[10.5,1,141.28,4.7019999999999999E-2,-0.66900000000000004,34.128999999999998,0.18587999999999999,-1.3320000000000001,17.178999999999998,0.12687000000000001,1,53.902000000000001,2.3539999999999998E-2]
[10.583,1,141.76,4.7190000000000003E-2,-0.65800000000000003,34.439300000000003,0.18659999999999999,-1.33,17.227,0.12706000000000001,1,53.929000000000002,2.3560000000000001E-2]
[10.667,1,142.22999999999999,4.734E-2,-0.64700000000000002,34.751800000000003,0.18729000000000001,-1.329,17.277000000000001,0.12725,1,53.954999999999998,2.358E-2]
[10.75,1,142.71,4.7489999999999997E-2,-0.63500000000000001,35.067999999999998,0.18794,-1.327,17.327000000000002,0.12742000000000001,1,53.981999999999999,2.3599999999999999E-2]
[10.833,1,143.18,4.7620000000000003E-2,-0.623,35.384500000000003,0.18855,-1.3260000000000001,17.376999999999999,0.12759000000000001,1,54.006999999999998,2.3619999999999999E-2]
[10.917,1,143.65,4.7739999999999998E-2,-0.61,35.704799999999999,0.18911,-1.3240000000000001,17.427,0.12773999999999999,1,54.033000000000001,2.3640000000000001E-2]
[11,1,144.12,4.7849999999999997E-2,-0.59699999999999998,36.03,0.18961,-1.3220000000000001,17.478000000000002,0.12789,1,54.06,2.366E-2]
[11.083,1,144.59,4.793E-2,-0.58399999999999996,36.358199999999997,0.19003999999999999,-1.321,17.53,0.12803,1,54.085000000000001,2.3689999999999999E-2]
[11.167,1,145.06,4.8000000000000001E-2,-0.56999999999999995,36.691099999999999,0.19040000000000001,-1.319,17.581,0.12816,1,54.11,2.3709999999999998E-2]
[11.25,1,145.53,4.8050000000000002E-2,-0.55600000000000005,37.029000000000003,0.19066,-1.3180000000000001,17.634,0.12827,1,54.134999999999998,2.3730000000000001E-2]
[11.333,1,146,4.8079999999999998E-2,-0.54100000000000004,37.373100000000001,0.19081999999999999,-1.3160000000000001,17.687000000000001,0.12837999999999999,1,54.16,2.375E-2]
[11.417,1,146.47,4.8090000000000001E-2,-0.52600000000000002,37.719700000000003,0.19089,-1.3140000000000001,17.739000000000001,0.12848999999999999,1,54.185000000000002,2.3769999999999999E-2]
[11.5,1,146.93,4.8079999999999998E-2,-0.51100000000000001,38.073999999999998,0.19084000000000001,-1.3120000000000001,17.792999999999999,0.12858,1,54.21,2.3789999999999999E-2]
[11.583,1,147.4,4.8050000000000002E-2,-0.496,38.433100000000003,0.19067000000000001,-1.3109999999999999,17.846,0.12866,1,54.234999999999999,2.3810000000000001E-2]
[11.667,1,147.87,4.7989999999999998E-2,-0.48,38.797699999999999,0.19039,-1.3089999999999999,17.899999999999999,0.12875,1,54.259,2.384E-2]
[11.75,1,148.34,4.7919999999999997E-2,-0.46500000000000002,39.167999999999999,0.19,-1.3069999999999999,17.954000000000001,0.12881999999999999,1,54.283000000000001,2.3859999999999999E-2]
[11.833,1,148.82,4.7820000000000001E-2,-0.44900000000000001,39.5443,0.1895,-1.306,18.007999999999999,0.12887999999999999,1,54.307000000000002,2.3879999999999998E-2]
[11.917,1,149.28,4.7699999999999999E-2,-0.434,39.927199999999999,0.18890999999999999,-1.304,18.062000000000001,0.12894,1,54.331000000000003,2.3900000000000001E-2]
[12,1,149.76,4.7550000000000002E-2,-0.41799999999999998,40.316000000000003,0.18820999999999999,-1.302,18.117000000000001,0.12898999999999999,1,54.354999999999997,2.392E-2]
[12.083,1,150.24,4.7390000000000002E-2,-0.40300000000000002,40.711799999999997,0.18743000000000001,-1.3,18.172000000000001,0.12903000000000001,1,54.378,2.3939999999999999E-2]
[12.167,1,150.71,4.7210000000000002E-2,-0.38800000000000001,41.113599999999998,0.18656,-1.2989999999999999,18.227,0.12906999999999999,1,54.401000000000003,2.3959999999999999E-2]
[12.25,1,151.18,4.7010000000000003E-2,-0.374,41.521799999999999,0.18562999999999999,-1.2969999999999999,18.280999999999999,0.12909999999999999,1,54.423999999999999,2.3980000000000001E-2]
[12.333,1,151.66,4.6800000000000001E-2,-0.36,41.935899999999997,0.18462000000000001,-1.2949999999999999,18.337,0.12912999999999999,1,54.447000000000003,2.4E-2]
[12.417,1,152.13,4.657E-2,-0.34699999999999998,42.354900000000001,0.18354999999999999,-1.2929999999999999,18.390999999999998,0.12914999999999999,1,54.47,2.4029999999999999E-2]
[12.5,1,152.6,4.632E-2,-0.33500000000000002,42.777900000000002,0.18243000000000001,-1.2909999999999999,18.446000000000002,0.12917000000000001,1,54.491999999999997,2.4049999999999998E-2]
[12.583,1,153.06,4.6059999999999997E-2,-0.32400000000000001,43.204500000000003,0.18128,-1.29,18.5,0.12917999999999999,1,54.515000000000001,2.4070000000000001E-2]
[12.667,1,153.52000000000001,4.5789999999999997E-2,-0.313,43.632800000000003,0.18009,-1.288,18.555,0.12917999999999999,1,54.536999999999999,2.409E-2]
[12.75,1,153.96,4.5510000000000002E-2,-0.30399999999999999,44.063499999999998,0.17887,-1.286,18.61,0.12919,1,54.558999999999997,2.4109999999999999E-2]
[12.833,1,154.41,4.5220000000000003E-2,-0.29499999999999998,44.495199999999997,0.17763999999999999,-1.284,18.664000000000001,0.12919,1,54.581000000000003,2.4129999999999999E-2]
[12.917,1,154.85,4.4920000000000002E-2,-0.28799999999999998,44.925899999999999,0.17641000000000001,-1.2829999999999999,18.718,0.12917999999999999,1,54.603000000000002,2.4150000000000001E-2]
[13,1,155.28,4.462E-2,-0.28100000000000003,45.3568,0.17518,-1.2809999999999999,18.771999999999998,0.12917000000000001,1,54.624000000000002,2.4170000000000001E-2]
[13.083,1,155.69999999999999,4.4310000000000002E-2,-0.27600000000000002,45.786299999999997,0.17394999999999999,-1.2789999999999999,18.824999999999999,0.12916,1,54.646000000000001,2.419E-2]
[13.167,1,156.11000000000001,4.3999999999999997E-2,-0.27100000000000002,46.2121,0.17274999999999999,-1.2769999999999999,18.88,0.12914,1,54.667000000000002,2.4209999999999999E-2]
[13.25,1,156.52000000000001,4.369E-2,-0.26800000000000002,46.633299999999998,0.17155999999999999,-1.276,18.931999999999999,0.12912999999999999,1,54.688000000000002,2.4230000000000002E-2]
[13.333,1,156.91,4.3380000000000002E-2,-0.26600000000000001,47.045699999999997,0.1704,-1.274,18.984999999999999,0.12909999999999999,1,54.71,2.4250000000000001E-2]
[13.417,1,157.28,4.3069999999999997E-2,-0.26500000000000001,47.451599999999999,0.16924,-1.272,19.038,0.12908,1,54.731000000000002,2.427E-2]
[13.5,1,157.65,4.2759999999999999E-2,-0.26500000000000001,47.849400000000003,0.16808999999999999,-1.2709999999999999,19.09,0.12905,1,54.750999999999998,2.4289999999999999E-2]
[13.583,1,158,4.2450000000000002E-2,-0.26600000000000001,48.241300000000003,0.16693,-1.2689999999999999,19.141999999999999,0.12902,1,54.771999999999998,2.4309999999999998E-2]
[13.667,1,158.35,4.215E-2,-0.26700000000000002,48.6218,0.16578999999999999,-1.2669999999999999,19.193999999999999,0.12898999999999999,1,54.792999999999999,2.4330000000000001E-2]
[13.75,1,158.69,4.1849999999999998E-2,-0.27,48.993000000000002,0.16464999999999999,-1.266,19.244,0.12895000000000001,1,54.813000000000002,2.435E-2]
[13.833,1,159.01,4.156E-2,-0.27400000000000002,49.3568,0.16350000000000001,-1.264,19.295000000000002,0.12892000000000001,1,54.832999999999998,2.4369999999999999E-2]
[13.917,1,159.31,4.1270000000000001E-2,-0.27800000000000002,49.708100000000002,0.16236999999999999,-1.262,19.344999999999999,0.12887999999999999,1,54.853000000000002,2.4389999999999998E-2]
[14,1,159.61000000000001,4.1000000000000002E-2,-0.28399999999999997,50.052,0.16123999999999999,-1.2609999999999999,19.395,0.12884000000000001,1,54.872999999999998,2.4410000000000001E-2]
[14.083,1,159.88999999999999,4.0730000000000002E-2,-0.28899999999999998,50.384599999999999,0.16014,-1.2589999999999999,19.445,0.12878999999999999,1,54.893999999999998,2.4420000000000001E-2]
[14.167,1,160.16,4.0460000000000003E-2,-0.29599999999999999,50.7117,0.15903999999999999,-1.258,19.492999999999999,0.12875,1,54.912999999999997,2.444E-2]
[14.25,1,160.41999999999999,4.0210000000000003E-2,-0.30299999999999999,51.024000000000001,0.15798000000000001,-1.256,19.542000000000002,0.12870000000000001,1,54.933,2.4459999999999999E-2]
[14.333,1,160.66999999999999,3.9969999999999999E-2,-0.31,51.326700000000002,0.15695000000000001,-1.254,19.588999999999999,0.12866,1,54.953000000000003,2.4479999999999998E-2]
[14.417,1,160.9,3.9739999999999998E-2,-0.318,51.621000000000002,0.15595000000000001,-1.2529999999999999,19.637,0.12861,1,54.972000000000001,2.4500000000000001E-2]
[14.5,1,161.12,3.952E-2,-0.32600000000000001,51.902999999999999,0.15498999999999999,-1.2509999999999999,19.684000000000001,0.12856000000000001,1,54.991999999999997,2.452E-2]
[14.583,1,161.32,3.9309999999999998E-2,-0.33500000000000002,52.176000000000002,0.15406,-1.25,19.73,0.12851000000000001,1,55.011000000000003,2.4539999999999999E-2]
[14.667,1,161.52000000000001,3.9100000000000003E-2,-0.34300000000000003,52.440399999999997,0.15315999999999999,-1.248,19.776,0.12845999999999999,1,55.03,2.4549999999999999E-2]
[14.75,1,161.71,3.8920000000000003E-2,-0.35199999999999998,52.692999999999998,0.15232000000000001,-1.2470000000000001,19.821999999999999,0.12839999999999999,1,55.048999999999999,2.4570000000000002E-2]
[14.833,1,161.88,3.8739999999999997E-2,-0.36099999999999999,52.936700000000002,0.15151999999999999,-1.2450000000000001,19.866,0.12834999999999999,1,55.067999999999998,2.4590000000000001E-2]
[14.917,1,162.03,3.8580000000000003E-2,-0.36899999999999999,53.170699999999997,0.15075,-1.244,19.911000000000001,0.1283,1,55.087000000000003,2.461E-2]
[15,1,162.18,3.8420000000000003E-2,-0.378,53.3947,0.15004999999999999,-1.242,19.954999999999998,0.12823999999999999,1,55.106000000000002,2.462E-2]
[15.083,1,162.32,3.8280000000000002E-2,-0.38600000000000001,53.611800000000002,0.14938000000000001,-1.2410000000000001,19.998000000000001,0.12819,1,55.124000000000002,2.4639999999999999E-2]
[15.167,1,162.44,3.8150000000000003E-2,-0.39500000000000002,53.820300000000003,0.14874999999999999,-1.2390000000000001,20.041,0.12812999999999999,1,55.142000000000003,2.4660000000000001E-2]
[15.25,1,162.56,3.8030000000000001E-2,-0.40300000000000002,54.021999999999998,0.14817,-1.238,20.082999999999998,0.12806999999999999,1,55.161000000000001,2.4680000000000001E-2]
[15.333,1,162.66,3.7920000000000002E-2,-0.41199999999999998,54.215699999999998,0.14763000000000001,-1.236,20.123999999999999,0.12801999999999999,1,55.179000000000002,2.47E-2]
[15.417,1,162.76,3.7819999999999999E-2,-0.42,54.403300000000002,0.14713000000000001,-1.2350000000000001,20.166,0.12795999999999999,1,55.197000000000003,2.4709999999999999E-2]
[15.5,1,162.85,3.7719999999999997E-2,-0.42799999999999999,54.584200000000003,0.14668,-1.2330000000000001,20.206,0.12790000000000001,1,55.215000000000003,2.4729999999999999E-2]
[15.583,1,162.91999999999999,3.764E-2,-0.436,54.758699999999997,0.14624999999999999,-1.232,20.245999999999999,0.12784999999999999,1,55.234000000000002,2.4750000000000001E-2]
[15.667,1,163,3.7560000000000003E-2,-0.443,54.927100000000003,0.14587,-1.2310000000000001,20.285,0.12778999999999999,1,55.250999999999998,2.4760000000000001E-2]
[15.75,1,163.06,3.7490000000000002E-2,-0.45100000000000001,55.088900000000002,0.14551,-1.2290000000000001,20.324000000000002,0.12773000000000001,1,55.268999999999998,2.478E-2]
[15.833,1,163.12,3.7429999999999998E-2,-0.45800000000000002,55.244,0.14518,-1.228,20.363,0.12767999999999999,1,55.286000000000001,2.4799999999999999E-2]
[15.917,1,163.18,3.737E-2,-0.46500000000000002,55.394300000000001,0.14487,-1.226,20.401,0.12762000000000001,1,55.304000000000002,2.4809999999999999E-2]
[16,1,163.22,3.7319999999999999E-2,-0.47199999999999998,55.537999999999997,0.14459,-1.2250000000000001,20.437999999999999,0.12756999999999999,1,55.320999999999998,2.4830000000000001E-2]
[16.082999999999998,1,163.27000000000001,3.7280000000000001E-2,-0.47899999999999998,55.676499999999997,0.14433000000000001,-1.224,20.475000000000001,0.12751000000000001,1,55.338999999999999,2.4850000000000001E-2]
[16.167000000000002,1,163.30000000000001,3.7229999999999999E-2,-0.48499999999999999,55.808599999999998,0.14409,-1.222,20.510999999999999,0.12745000000000001,1,55.354999999999997,2.486E-2]
[16.25,1,163.34,3.7199999999999997E-2,-0.49099999999999999,55.935499999999998,0.14387,-1.2210000000000001,20.547000000000001,0.12740000000000001,1,55.372999999999998,2.4879999999999999E-2]
[16.332999999999998,1,163.37,3.7159999999999999E-2,-0.497,56.056100000000001,0.14366000000000001,-1.22,20.582000000000001,0.12734000000000001,1,55.39,2.4889999999999999E-2]
[16.417000000000002,1,163.4,3.7130000000000003E-2,-0.503,56.171300000000002,0.14346999999999999,-1.218,20.617000000000001,0.12728999999999999,1,55.405999999999999,2.4910000000000002E-2]
[16.5,1,163.41999999999999,3.7109999999999997E-2,-0.50800000000000001,56.281599999999997,0.14330000000000001,-1.2170000000000001,20.652000000000001,0.12723000000000001,1,55.423999999999999,2.4930000000000001E-2]
[16.582999999999998,1,163.44999999999999,3.7080000000000002E-2,-0.51300000000000001,56.386299999999999,0.14313999999999999,-1.216,20.684999999999999,0.12717999999999999,1,55.441000000000003,2.494E-2]
[16.667000000000002,1,163.46,3.7069999999999999E-2,-0.51800000000000002,56.485399999999998,0.14299000000000001,-1.214,20.718,0.12712000000000001,1,55.457000000000001,2.496E-2]
[16.75,1,163.47999999999999,3.705E-2,-0.52300000000000002,56.581000000000003,0.14285999999999999,-1.2130000000000001,20.751000000000001,0.12706999999999999,1,55.473999999999997,2.4969999999999999E-2]
[16.832999999999998,1,163.49,3.7039999999999997E-2,-0.52800000000000002,56.671300000000002,0.14274000000000001,-1.212,20.783000000000001,0.12701999999999999,1,55.491,2.4989999999999998E-2]
[16.917000000000002,1,163.5,3.703E-2,-0.53200000000000003,56.756700000000002,0.14262,-1.21,20.815999999999999,0.12695999999999999,1,55.506,2.5010000000000001E-2]
[17,1,163.51,3.7019999999999997E-2,-0.53600000000000003,56.838000000000001,0.14252000000000001,-1.2090000000000001,20.847000000000001,0.12691,1,55.52,2.5010000000000001E-2]
[17.082999999999998,1,163.51,3.7010000000000001E-2,-0.54,56.9163,0.14243,-1.208,20.878,0.12686]
[17.167000000000002,1,163.52000000000001,3.7010000000000001E-2,-0.54400000000000004,56.989199999999997,0.14233999999999999,-1.206,20.908000000000001,0.12681000000000001]
[17.25,1,163.52000000000001,3.7010000000000001E-2,-0.54700000000000004,57.058999999999997,0.14226,-1.2050000000000001,20.937999999999999,0.12676000000000001]
[17.332999999999998,1,163.52000000000001,3.7010000000000001E-2,-0.55100000000000005,57.124699999999997,0.14218,-1.204,20.968,0.12670999999999999]
[17.417000000000002,1,163.52000000000001,3.6999999999999998E-2,-0.55400000000000005,57.1875,0.14210999999999999,-1.2030000000000001,20.997,0.12665999999999999]
[17.5,1,163.53,3.6999999999999998E-2,-0.55700000000000005,57.246899999999997,0.14204,-1.2010000000000001,21.026,0.12659999999999999]
[17.582999999999998,1,163.53,3.6990000000000002E-2,-0.56000000000000005,57.304099999999998,0.14198,-1.2,21.053999999999998,0.12656000000000001]
[17.667000000000002,1,163.54,3.6990000000000002E-2,-0.56299999999999994,57.356999999999999,0.14191999999999999,-1.1990000000000001,21.082000000000001,0.1265]
[17.75,1,163.55000000000001,3.6979999999999999E-2,-0.56499999999999995,57.406999999999996,0.14187,-1.1970000000000001,21.11,0.12645999999999999]
[17.832999999999998,1,163.56,3.6970000000000003E-2,-0.56799999999999995,57.4557,0.14182,-1.196,21.137,0.12640999999999999]
[17.917000000000002,1,163.57,3.696E-2,-0.56999999999999995,57.500799999999998,0.14177000000000001,-1.1950000000000001,21.164000000000001,0.12636]
[18,1,163.57,3.6949999999999997E-2,-0.57199999999999995,57.543999999999997,0.14172999999999999,-1.194,21.19,0.12631000000000001]
[18.082999999999998,1,163.58000000000001,3.6949999999999997E-2,-0.57399999999999995,57.584699999999998,0.14168,-1.1930000000000001,21.216000000000001,0.12626999999999999]
[18.167000000000002,1,163.59,3.6940000000000001E-2,-0.57599999999999996,57.6235,0.14165,-1.1910000000000001,21.242000000000001,0.12622]
[18.25,1,163.6,3.6929999999999998E-2,-0.57799999999999996,57.66,0.14161000000000001,-1.19,21.266999999999999,0.12617]
[18.332999999999998,1,163.6,3.6929999999999998E-2,-0.57999999999999996,57.695300000000003,0.14157,-1.1890000000000001,21.292999999999999,0.12612999999999999]
[18.417000000000002,1,163.61000000000001,3.6920000000000001E-2,-0.58199999999999996,57.7288,0.14154,-1.1879999999999999,21.317,0.12608]
[18.5,1,163.61000000000001,3.6920000000000001E-2,-0.58299999999999996,57.76,0.14151,-1.1859999999999999,21.341999999999999,0.12604000000000001]
[18.582999999999998,1,163.62,3.6909999999999998E-2,-0.58499999999999996,57.790399999999998,0.14147999999999999,-1.1850000000000001,21.366,0.126]
[18.667000000000002,1,163.62,3.6909999999999998E-2,-0.58599999999999997,57.819899999999997,0.14144999999999999,-1.1839999999999999,21.39,0.12595000000000001]
[18.75,1,163.62,3.6909999999999998E-2,-0.58799999999999997,57.847000000000001,0.14141999999999999,-1.1830000000000001,21.413,0.12590999999999999]
[18.832999999999998,1,163.63,3.6909999999999998E-2,-0.58899999999999997,57.872799999999998,0.1414,-1.181,21.436,0.12587000000000001]
[18.917000000000002,1,163.63,3.6909999999999998E-2,-0.59,57.896999999999998,0.14137,-1.18,21.459,0.12581999999999999]
[19,1,163.63,3.6909999999999998E-2,-0.59099999999999997,57.92,0.14135,-1.179,21.481999999999999,0.12578]
[19.082999999999998,1,163.63,3.6909999999999998E-2,-0.59299999999999997,57.942100000000003,0.14133000000000001,-1.1779999999999999,21.504000000000001,0.12573999999999999]
[19.167000000000002,1,163.63,3.6909999999999998E-2,-0.59399999999999997,57.962699999999998,0.14130999999999999,-1.177,21.527000000000001,0.12570000000000001]
[19.25,1,163.63,3.6909999999999998E-2,-0.59499999999999997,57.981999999999999,0.14129,-1.175,21.547999999999998,0.12565999999999999]
[19.332999999999998,1,163.63,3.6909999999999998E-2,-0.59499999999999997,58.0002,0.14127000000000001,-1.1739999999999999,21.57,0.12561]
[19.417000000000002,1,163.63,3.6909999999999998E-2,-0.59599999999999997,58.016399999999997,0.14126,-1.173,21.591000000000001,0.12558]
[19.5,1,163.63,3.6900000000000002E-2,-0.59699999999999998,58.031999999999996,0.14124,-1.1719999999999999,21.611999999999998,0.12554000000000001]
[19.582999999999998,1,163.63,3.6900000000000002E-2,-0.59799999999999998,58.046399999999998,0.14122999999999999,-1.171,21.632999999999999,0.1255]
[19.667000000000002,1,163.63,3.6900000000000002E-2,-0.59899999999999998,58.059699999999999,0.14122000000000001,-1.169,21.652999999999999,0.12545999999999999]
[19.75,1,163.63,3.6900000000000002E-2,-0.59899999999999998,58.072000000000003,0.14119999999999999,-1.1679999999999999,21.673999999999999,0.12542]
[19.832999999999998,1,163.63999999999999,3.6900000000000002E-2,-0.6,58.083300000000001,0.14119000000000001,-1.167,21.695,0.12537999999999999]
[19.917000000000002,1,163.63999999999999,3.6900000000000002E-2,-0.6,58.093600000000002,0.14118,-1.1659999999999999,21.715,0.12534000000000001]
[20,1,163.63999999999999,3.6900000000000002E-2,-0.60099999999999998,58.103999999999999,0.14116999999999999,-1.165,21.734999999999999,0.12529999999999999]
[20.082999999999998,1,163.63999999999999,3.6900000000000002E-2,-0.60099999999999998,58.112699999999997,0.14116000000000001,-1.163,21.754999999999999,0.12526999999999999]
[20.167000000000002,1,163.63999999999999,3.6900000000000002E-2,-0.60199999999999998,58.121699999999997,0.14116000000000001,-1.1619999999999999,21.774000000000001,0.12523000000000001]
[20.25,1,163.65,3.6889999999999999E-2,-0.60199999999999998,58.128999999999998,0.14115,-1.161,21.792999999999999,0.12519]
[20.332999999999998,1,163.65,3.6889999999999999E-2,-0.60199999999999998,58.136000000000003,0.14113999999999999,-1.1599999999999999,21.812999999999999,0.12515999999999999]
[20.417000000000002,1,163.65,3.6889999999999999E-2,-0.60299999999999998,58.142600000000002,0.14113999999999999,-1.159,21.832000000000001,0.12512000000000001]
[20.5,1,163.65,3.6889999999999999E-2,-0.60299999999999998,58.148000000000003,0.14113000000000001,-1.1579999999999999,21.850999999999999,0.12508]
[20.582999999999998,1,163.65,3.6889999999999999E-2,-0.60299999999999998,58.152999999999999,0.14113000000000001,-1.1559999999999999,21.87,0.12504999999999999]
[20.667000000000002,1,163.65,3.6889999999999999E-2,-0.60399999999999998,58.156700000000001,0.14112,-1.155,21.888000000000002,0.12501000000000001]
[20.75,1,163.65,3.6889999999999999E-2,-0.60399999999999998,58.16,0.14112,-1.1539999999999999,21.907,0.12497999999999999]
[20.832999999999998,1,163.65,3.6889999999999999E-2,-0.60399999999999998,58.161900000000003,0.14112,-1.153,21.925000000000001,0.12494]
[20.917000000000002,1,163.65,3.6889999999999999E-2,-0.60399999999999998,58.162999999999997,0.14112,-1.1519999999999999,21.943000000000001,0.1249]
[21,1,163.66,3.6889999999999999E-2,-0.60399999999999998,58.162999999999997,0.14112,-1.151,21.960999999999999,0.12486999999999999]
[21.082999999999998,1,163.66,3.6889999999999999E-2,-0.60399999999999998,58.164000000000001,0.14112,-1.149,21.978999999999999,0.12484000000000001]
[21.167000000000002,1,163.66,3.6889999999999999E-2,-0.60399999999999998,58.164999999999999,0.14111000000000001,-1.1479999999999999,21.997,0.12479999999999999]
[21.25,1,163.66999999999999,3.6880000000000003E-2,-0.60399999999999998,58.167000000000002,0.14111000000000001,-1.147,22.015000000000001,0.12477000000000001]
[21.332999999999998,1,163.66999999999999,3.6880000000000003E-2,-0.60399999999999998,58.170699999999997,0.14111000000000001,-1.1459999999999999,22.032,0.12472999999999999]
[21.417000000000002,1,163.68,3.6880000000000003E-2,-0.60399999999999998,58.1738,0.1411,-1.145,22.05,0.12470000000000001]
[21.5,1,163.69,3.687E-2,-0.60499999999999998,58.177999999999997,0.14108999999999999,-1.1439999999999999,22.067,0.12467]
[21.582999999999998,1,163.69,3.687E-2,-0.60499999999999998,58.183300000000003,0.14108999999999999,-1.143,22.085000000000001,0.12463]
[21.667000000000002,1,163.69999999999999,3.687E-2,-0.60499999999999998,58.188699999999997,0.14108000000000001,-1.1419999999999999,22.102,0.1246]
[21.75,1,163.71,3.6859999999999997E-2,-0.60599999999999998,58.194000000000003,0.14107,-1.1399999999999999,22.119,0.12456]
[21.832999999999998,1,163.72,3.6859999999999997E-2,-0.60599999999999998,58.200299999999999,0.14105999999999999,-1.139,22.135999999999999,0.12453]
[21.917000000000002,1,163.72999999999999,3.6850000000000001E-2,-0.60599999999999998,58.206600000000002,0.14105000000000001,-1.1379999999999999,22.152999999999999,0.1245]
[22,1,163.72999999999999,3.6850000000000001E-2,-0.60699999999999998,58.213000000000001,0.14104,-1.137,22.17,0.12447]
[22.082999999999998,1,163.74,3.6839999999999998E-2,-0.60699999999999998,58.22,0.14104,-1.1359999999999999,22.187000000000001,0.12443]
[22.167000000000002,1,163.75,3.6839999999999998E-2,-0.60699999999999998,58.226700000000001,0.14102999999999999,-1.135,22.202999999999999,0.1244]
[22.25,1,163.76,3.6830000000000002E-2,-0.60799999999999998,58.232999999999997,0.14102000000000001,-1.1339999999999999,22.22,0.12436999999999999]
[22.332999999999998,1,163.77000000000001,3.6830000000000002E-2,-0.60799999999999998,58.240099999999998,0.14101,-1.133,22.236999999999998,0.12434000000000001]
[22.417000000000002,1,163.78,3.6819999999999999E-2,-0.60799999999999998,58.247599999999998,0.14099999999999999,-1.1319999999999999,22.254000000000001,0.12429999999999999]
[22.5,1,163.78,3.6819999999999999E-2,-0.60899999999999999,58.254600000000003,0.14099,-1.131,22.271000000000001,0.12427000000000001]
[22.582999999999998,1,163.79,3.6819999999999999E-2,-0.60899999999999999,58.262,0.14097999999999999,-1.1299999999999999,22.286999999999999,0.12424]
[22.667000000000002,1,163.80000000000001,3.6810000000000002E-2,-0.61,58.268999999999998,0.14096,-1.129,22.303000000000001,0.12421]
[22.75,1,163.80000000000001,3.6810000000000002E-2,-0.61,58.277000000000001,0.14094999999999999,-1.127,22.318999999999999,0.12418]
[22.832999999999998,1,163.81,3.6810000000000002E-2,-0.61,58.283999999999999,0.14094000000000001,-1.1259999999999999,22.335999999999999,0.12414]
[22.917000000000002,1,163.82,3.6799999999999999E-2,-0.61099999999999999,58.291699999999999,0.14093,-1.125,22.352,0.12411]
[23,1,163.82,3.6799999999999999E-2,-0.61099999999999999,58.296999999999997,0.14093,-1.125,22.364000000000001,0.12409000000000001]

{"sheet":"Daily Sheets","index":11,"n_rows":87,"n_cols":11,"rows_kept":87,"cut":false,"hidden":true,"merged":[[1,5,1,6],[1,7,1,9],[1,10,11,10],[2,5,2,6],[2,7,2,9],[3,5,3,6],[3,7,3,9],[4,5,4,6],[4,7,4,9],[57,5,57,6],[57,7,57,9],[6,2,6,4],[54,5,54,6],[54,7,54,9],[55,5,55,6],[55,7,55,9],[56,5,56,6],[56,7,56,9],[58,8,58,10],[65,1,65,2],[66,1,66,2],[62,1,62,2],[63,1,63,2],[61,1,61,2]]}
[]
[null,null,null,null,null,"Name",null,{"$f":"Details!B2&\" \"&Details!B3","v":" "},null,null,{"$f":"C7","v":"2022-05-20T13:10:07.600"}]
[null,null,null,null,null,"Date of Birth",null,{"$f":"Details!B6","v":"00:00:00"}]
[null,null,null,null,null,"Unit Number",null,{"$f":"Details!B4","v":0}]
[null,null,null,null,null,"NHS Number",null,{"$f":"Details!B5","v":0}]
[]
[null,"Date",{"$f":"Details!B10+D8","v":"2022-05-20T13:10:07.600"}]
[null,"Admission Day",null,1,null," (Day of admission = Day 0)"]
[]
[null,{"$f":"IF(D8=1,\"Admission Weight= \"&Details!B12&\" kg, Height= \"&Details!B13&\" cm   BMI= \"&Details!B14&\" kg/m2   (%BMI= \"&Details!B15&\" )\",IF(OR(WEEKDAY(C7)=2,WEEKDAY(C7)=5), \"Weight Today before Breakfast-            Weight__________ kg\", \"Last Weight__________ kg\"))","v":"Admission Weight=  kg, Height=  cm   BMI= 0 kg/m2   (%BMI= 0 )"}]
[]
[null,"Joint Medical & Nursing Ward Round"]
[null,null,{"$f":"IF(Details!B24=\"Yes\",IF(D8<6,\"Re-Feeding Risk-->  Day \"&D8,\"Re-feeding Risk ?     Yes / No\"),\"Re-feeding Risk ?     Yes / No\")","v":"Re-Feeding Risk-->  Day 1"}]
[null,null,"Compliance with Diet"]
[null,null,null,"Meal Plan Number  _______ "]
[null,null,null,null,null,null,null,null,null,"Place an X"]
[null,null,null,"0%",null,0.5,null,null,1]
[null,null,"Compliancy with Activity"]
[null,null,null,"Fully Compliant    /  Partially Compliant    /  Not Compliant ",null,null,null,null,null,"Circle"]
[]
[null,null,"Examination"]
[]
[null,null,"Heart Rate / Pulse"]
[null,null,"Perfusion"]
[null,null,"Oedema"]
[]
[null,"Plan"]
[null,"Stage of Care",null," Refeeding",null,"Consolidation",null,"Home/Discharge",null,"Circle"]
[null,"Re-feeding bloods needed",null,null,"Yes / No","Taken","o","Reviewed","¨"]
[null,"Continuous ECG Monitoring",null,null,"Yes / No"]
[null,"Observation frequency",null,null,"4 Hourly / 12 Hourly",null,"Circle"]
[null,"Current Activity (from preceeding MDT)",null,null,null,null,null,"Circle"]
[null,null,"Complete Bed Rest (commode or wheelchair for toilet)"]
[null,null,"Allowed from bed to chair"]
[null,null,"Walk to toilet"]
[null,null,"Allowed off ward (in wheelchair)"]
[null,null,"Home leave allowed-",null,null,"Check lying/standing BP before leaving ward"]
[]
[]
[]
[]
[]
[]
[]
[]
[]
[]
[]
[]
[]
[]
[]
[]
[]
[null,null,null,null,null,"Name",null,{"$f":"Details!B2&\" \"&Details!B3","v":" "}]
[null,null,null,null,null,"Date of Birth",null,{"$f":"Details!B6","v":"00:00:00"}]
[null,null,null,null,null,"Unit Number",null,{"$f":"Details!B4","v":0}]
[null,null,null,null,null,"NHS Number",null,{"$f":"Details!B5","v":0}]
[null,null,null,null,null,null,null,null,{"$f":"Details!B10+D8","v":"2022-05-20T13:10:07.600"}]
[null,{"$f":"IF(OR(WEEKDAY(C7)=2,WEEKDAY(C7)=5),\"Multidisciplinary Meeting\",\"\")","v":""}]
[null,null,null,null,{"$f":"IF(OR(WEEKDAY(C7)=2,WEEKDAY(C7)=5),\"Name(s)\",\"\")","v":""},null,null,{"$f":"IF(OR(WEEKDAY(C7)=2,WEEKDAY(C7)=5),\"Role\",\"\")","v":""}]
[null,{"$f":"IF(OR(WEEKDAY(C7)=2,WEEKDAY(C7)=5),\"Medical Consultant\",\"\")","v":""}]
[null,{"$f":"IF(OR(WEEKDAY(C7)=2,WEEKDAY(C7)=5),\"Nurse\",\"\")","v":""}]
[null,{"$f":"IF(OR(WEEKDAY(C7)=2,WEEKDAY(C7)=5),\"CAMHS\",\"\")","v":""}]
[]
[null,{"$f":"IF(OR(WEEKDAY(C7)=2,WEEKDAY(C7)=5),\"Dietician\",\"\")","v":""}]
[null,{"$f":"IF(OR(WEEKDAY(C7)=2,WEEKDAY(C7)=5),\"Parent(s)\",\"\")","v":""}]
[]
[null,{"$f":"IF(OR(WEEKDAY(C7)=2,WEEKDAY(C7)=5),\"Summary\",\"\")","v":""}]
[]
[]
[]
[]
[]
[]
[]
[]
[null,{"$f":"IF(OR(WEEKDAY(C7)=2,WEEKDAY(C7)=5),\"Stage of Care\",\"\")","v":""},null,{"$f":"IF(OR(WEEKDAY(C7)=2,WEEKDAY(C7)=5),\"Refeeding\",\"\")","v":""},null,{"$f":"IF(OR(WEEKDAY(C7)=2,WEEKDAY(C7)=5),\"Consolidation\",\"\")","v":""},null,{"$f":"IF(OR(WEEKDAY(C7)=2,WEEKDAY(C7)=5),\"Home/Discharge\",\"\")","v":""},null,{"$f":"IF(OR(WEEKDAY(C7)=2,WEEKDAY(C7)=5),\"Circle\",\"\")","v":""}]
[null,{"$f":"IF(OR(WEEKDAY(C7)=2,WEEKDAY(C7)=5),\"Re-feeding bloods needed Yes / No for further _______ Days\",\"\")","v":""}]
[null,{"$f":"IF(OR(WEEKDAY(C7)=2,WEEKDAY(C7)=5),\"Continuous ECG Monitoring  Yes / No\",\"\")","v":""}]
[null,{"$f":"IF(OR(WEEKDAY(C7)=2,WEEKDAY(C7)=5),\"Observation frequency 4 Hourly / 12 Hourly (circle)\",\"\")","v":""}]
[null,{"$f":"IF(OR(WEEKDAY(C7)=2,WEEKDAY(C7)=5),\"Current Activity until next MDT\",\"\")","v":""},null,null,null,null,null,{"$f":"IF(OR(WEEKDAY(C7)=2,WEEKDAY(C7)=5),\"Circle\",\"\")","v":""}]
[null,null,{"$f":"IF(OR(WEEKDAY(C7)=2,WEEKDAY(C7)=5),\"Complete Bed Rest (commode or wheelchair for toilet)\",\"\")","v":""}]
[null,null,{"$f":"IF(OR(WEEKDAY(C7)=2,WEEKDAY(C7)=5),\"Allowed from bed to chair\",\"\")","v":""}]
[null,null,{"$f":"IF(OR(WEEKDAY(C7)=2,WEEKDAY(C7)=5),\"Walk to toilet\",\"\")","v":""}]
[null,null,{"$f":"IF(OR(WEEKDAY(C7)=2,WEEKDAY(C7)=5),\"Allowed off ward (in wheelchair)\",\"\")","v":""}]
[null,null,{"$f":"IF(OR(WEEKDAY(C7)=2,WEEKDAY(C7)=5),\"Home leave allowed\",\"\")","v":""}]

{"sheet":"Daily Sheets Extend","index":12,"n_rows":87,"n_cols":11,"rows_kept":87,"cut":false,"hidden":true,"merged":[[56,5,56,6],[56,7,56,9],[1,5,1,6],[1,7,1,9],[1,10,11,10],[2,5,2,6],[2,7,2,9],[3,5,3,6],[3,7,3,9],[4,5,4,6],[4,7,4,9],[6,2,6,4],[54,5,54,6],[54,7,54,9],[55,5,55,6],[55,7,55,9],[65,1,65,2],[66,1,66,2],[57,5,57,6],[57,7,57,9],[58,8,58,10],[61,1,61,2],[62,1,62,2],[63,1,63,2]]}
[]
[null,null,null,null,null,"Name",null,{"$f":"Details!B2&\" \"&Details!B3","v":" "},null,null,{"$f":"C7","v":"2022-05-20T13:10:07.600"}]
[null,null,null,null,null,"Date of Birth",null,{"$f":"Details!B6","v":"00:00:00"}]
[null,null,null,null,null,"Unit Number",null,{"$f":"Details!B4","v":0}]
[null,null,null,null,null,"NHS Number",null,{"$f":"Details!B5","v":0}]
[]
[null,"Date",{"$f":"Details!B43+D8","v":"2022-05-20T13:10:07.600"}]
[null,"Admission Day",null,{"$f":"Details!B45","v":1},null," (Day of admission = Day 0)"]
[]
[null,{"$f":"IF(OR(WEEKDAY(C7)=2,WEEKDAY(C7)=5), \"Weight Today before Breakfast-            Weight__________ kg\", \"Last Weight__________ kg\")","v":"Last Weight__________ kg"}]
[]
[null,"Joint Medical & Nursing Ward Round"]
[null,null,{"$f":"IF(Details!B24=\"Yes\",IF(D8<6,\"Re-Feeding Risk-->  Day \"&D8,\"Re-feeding Risk ?     Yes / No\"),\"Re-feeding Risk ?     Yes / No\")","v":"Re-Feeding Risk-->  Day 1"}]
[null,null,"Compliance with Diet"]
[null,null,null,"Meal Plan Number  _______ "]
[null,null,null,null,null,null,null,null,null,"Place an X"]
[null,null,null,"0%",null,0.5,null,null,1]
[null,null,"Compliancy with Activity"]
[null,null,null,"Fully Compliant    /  Partially Compliant    /  Not Compliant ",null,null,null,null,null,"Circle"]
[]
[null,null,"Examination"]
[]
[null,null,"Heart Rate / Pulse"]
[null,null,"Perfusion"]
[null,null,"Oedema"]
[]
[null,"Plan"]
[null,"Stage of Care",null," Refeeding",null,"Consolidation",null,"Home/Discharge",null,"Circle"]
[null,"Re-feeding bloods needed",null,null,"Yes / No","Taken","o","Reviewed","¨"]
[null,"Continuous ECG Monitoring",null,null,"Yes / No"]
[null,"Observation frequency",null,null,"4 Hourly / 12 Hourly",null,"Circle"]
[null,"Current Activity (from preceeding MDT)",null,null,null,null,null,"Circle"]
[null,null,"Complete Bed Rest (commode or wheelchair for toilet)"]
[null,null,"Allowed from bed to chair"]
[null,null,"Walk to toilet"]
[null,null,"Allowed off ward (in wheelchair)"]
[null,null,"Home leave allowed-",null,null,"Check lying/standing BP before leaving ward"]
[]
[]
[]
[]
[]
[]
[]
[]
[]
[]
[]
[]
[]
[]
[]
[]
[]
[null,null,null,null,null,"Name",null,{"$f":"Details!B2&\" \"&Details!B3","v":" "}]
[null,null,null,null,null,"Date of Birth",null,{"$f":"Details!B6","v":"00:00:00"}]
[null,null,null,null,null,"Unit Number",null,{"$f":"Details!B4","v":0}]
[null,null,null,null,null,"NHS Number",null,{"$f":"Details!B5","v":0}]
[null,null,null,null,null,null,null,null,{"$f":"Details!B10+D8","v":"2022-05-20T13:10:07.600"}]
[null,{"$f":"IF(OR(WEEKDAY(C7)=2,WEEKDAY(C7)=5),\"Multidisciplinary Meeting\",\"\")","v":""}]
[null,null,null,null,{"$f":"IF(OR(WEEKDAY(C7)=2,WEEKDAY(C7)=5),\"Name(s)\",\"\")","v":""},null,null,{"$f":"IF(OR(WEEKDAY(C7)=2,WEEKDAY(C7)=5),\"Role\",\"\")","v":""}]
[null,{"$f":"IF(OR(WEEKDAY(C7)=2,WEEKDAY(C7)=5),\"Medical Consultant\",\"\")","v":""}]
[null,{"$f":"IF(OR(WEEKDAY(C7)=2,WEEKDAY(C7)=5),\"Nurse\",\"\")","v":""}]
[null,{"$f":"IF(OR(WEEKDAY(C7)=2,WEEKDAY(C7)=5),\"CAMHS\",\"\")","v":""}]
[]
[null,{"$f":"IF(OR(WEEKDAY(C7)=2,WEEKDAY(C7)=5),\"Dietician\",\"\")","v":""}]
[null,{"$f":"IF(OR(WEEKDAY(C7)=2,WEEKDAY(C7)=5),\"Parent(s)\",\"\")","v":""}]
[]
[null,{"$f":"IF(OR(WEEKDAY(C7)=2,WEEKDAY(C7)=5),\"Summary\",\"\")","v":""}]
[]
[]
[]
[]
[]
[]
[]
[]
[null,{"$f":"IF(OR(WEEKDAY(C7)=2,WEEKDAY(C7)=5),\"Stage of Care\",\"\")","v":""},null,{"$f":"IF(OR(WEEKDAY(C7)=2,WEEKDAY(C7)=5),\"Refeeding\",\"\")","v":""},null,{"$f":"IF(OR(WEEKDAY(C7)=2,WEEKDAY(C7)=5),\"Consolidation\",\"\")","v":""},null,{"$f":"IF(OR(WEEKDAY(C7)=2,WEEKDAY(C7)=5),\"Home/Discharge\",\"\")","v":""},null,{"$f":"IF(OR(WEEKDAY(C7)=2,WEEKDAY(C7)=5),\"Circle\",\"\")","v":""}]
[null,{"$f":"IF(OR(WEEKDAY(C7)=2,WEEKDAY(C7)=5),\"Re-feeding bloods needed Yes / No for further _______ Days\",\"\")","v":""}]
[null,{"$f":"IF(OR(WEEKDAY(C7)=2,WEEKDAY(C7)=5),\"Continuous ECG Monitoring  Yes / No\",\"\")","v":""}]
[null,{"$f":"IF(OR(WEEKDAY(C7)=2,WEEKDAY(C7)=5),\"Observation frequency 4 Hourly / 12 Hourly (circle)\",\"\")","v":""}]
[null,{"$f":"IF(OR(WEEKDAY(C7)=2,WEEKDAY(C7)=5),\"Current Activity until next MDT\",\"\")","v":""},null,null,null,null,null,{"$f":"IF(OR(WEEKDAY(C7)=2,WEEKDAY(C7)=5),\"Circle\",\"\")","v":""}]
[null,null,{"$f":"IF(OR(WEEKDAY(C7)=2,WEEKDAY(C7)=5),\"Complete Bed Rest (commode or wheelchair for toilet)\",\"\")","v":""}]
[null,null,{"$f":"IF(OR(WEEKDAY(C7)=2,WEEKDAY(C7)=5),\"Allowed from bed to chair\",\"\")","v":""}]
[null,null,{"$f":"IF(OR(WEEKDAY(C7)=2,WEEKDAY(C7)=5),\"Walk to toilet\",\"\")","v":""}]
[null,null,{"$f":"IF(OR(WEEKDAY(C7)=2,WEEKDAY(C7)=5),\"Allowed off ward (in wheelchair)\",\"\")","v":""}]
[null,null,{"$f":"IF(OR(WEEKDAY(C7)=2,WEEKDAY(C7)=5),\"Home leave allowed\",\"\")","v":""}]

{"sheet":"Meal Support","index":13,"n_rows":13,"n_cols":2,"rows_kept":13,"cut":false,"hidden":true,"merged":[[11,1,11,5],[12,1,12,5],[4,1,4,4],[5,1,5,4],[6,1,6,5],[7,1,7,5],[8,1,8,5],[9,1,9,5],[0,0,0,5],[1,1,1,5],[2,1,2,5],[3,1,3,5],[10,1,10,5]]}
["Meal Time Support"]
["n","Try to remember eating is normal, we all do it! "]
["n","Food is Fuel and our bodies need regular fuel to survive, like a car would brakdown if it ran out of petrol. You don't have to love or like your food (it helps), but you do need to eat to survive."]
["n","Distractions can be a big help for managing anxiety before, during and after a meal. Think about what distractions might be helpful for you. Some examples of things other young people have found helpful include: a place mat with motivational words or goals on, playing a game with the family, have a puzzle to do like Sudoku, reading and watching your favourite TV show or movie."]
["n","You might want to look at this animation of an A-Z list of coping strategies; https://www.youtube.com/watch?v=5EXpkVw3fh0&feature=youtu.be"]
["n","To help manage any negative emotions you might want to make a ‘self-soothe’ or ‘coping box’. This is a place where you store any items that bring you comfort, it might include things that are soothing to the senses like smelly candles or bubble wrap to pop, it might have some distraction toys in like fidget spinners or stress balls or it might be something that makes you smile or feel better like a letter from a loved one, pictures or a memory. Take a look at this animation which tells you more about coping boxes: https://www.youtube.com/watch?v=OyfgodSSdV4&feature=youtu.be "]
["n","At the table it might be helpful to have non-problem focused talk (e.g., what happened that day) - have some cards with topics on to save having to think about it when everyone is stressed or worried."]
["n","Each person is individual on the environments they find most calming. Have a think about what some of your preferences are e.g. do you like having music/ radio/ TV/ chatting in the background or a quiet space (some people like some background noise some don’t)."]
["n","Have anyone that helps nearby (in person or on the phone)"]
["n","Have a chilled activity planned for afterwards (see distraction list)- away from kitchen."]
["n","If you’re going out to eat, check menus before- have option A and B in mind in case option A not available"]
["n","If you’re going out sit somewhere quieter if that helps; perhaps book a table in advance"]
["n","Remember that your parents are only trying to help. If they say or do something that you find unhelpful, let them know and if there is something they can do or say that is more helpful."]

{"sheet":"Investigations","index":14,"n_rows":36,"n_cols":9,"rows_kept":36,"cut":false,"hidden":true,"merged":[[33,1,33,8],[34,1,34,8],[35,1,35,8],[0,6,0,8],[0,0,0,3],[26,0,26,8],[28,1,28,8],[29,1,29,8],[30,1,30,8],[31,1,31,8],[32,1,32,8]]}
[{"$f":"Details!B2&\" \"&Details!B3","v":" "},null,null,null,null,{"$f":"\"Date of Birth   \"","v":"Date of Birth   "},{"$f":"Details!B6","v":"00:00:00"}]
["Day",{"$f":"Details!B10","v":"2022-05-19T13:10:07.600"},{"$f":"IF(Details!$B$24=\"Yes\",B$2+1,\"\")","v":"2022-05-20T13:10:07.600"},{"$f":"IF(Details!$B$24=\"Yes\",C$2+1,\"\")","v":"2022-05-21T13:10:07.600"},{"$f":"IF(Details!$B$24=\"Yes\",D$2+1,\"\")","v":"2022-05-22T13:10:07.600"},{"$f":"IF(Details!$B$24=\"Yes\",E$2+1,\"\")","v":"2022-05-23T13:10:07.600"},{"$f":"IF(Details!$B$24=\"Yes\",F$2+1,\"\")","v":"2022-05-24T13:10:07.600"}]
["Time"]
["Day",0,{"$f":"IF(Details!$B$24=\"Yes\",B$4+1,\"\")","v":1},{"$f":"IF(Details!$B$24=\"Yes\",C$4+1,\"\")","v":2},{"$f":"IF(Details!$B$24=\"Yes\",D$4+1,\"\")","v":3},{"$f":"IF(Details!$B$24=\"Yes\",E$4+1,\"\")","v":4},{"$f":"IF(Details!$B$24=\"Yes\",F$4+1,\"\")","v":5}]
["Sodium"]
["Potassium"]
["Urea"]
["Creatinine"]
["Albumin"]
["Magnesium"]
["Phosphate"]
["Bilirubin"]
["Total  Protein"]
["ALT"]
["Alk Phos"]
["Calcium"]
["Correct Ca2+"]
["Chloride"]
["Bicarbonate"]
["Lactate"]
["Glucose"]
["Haemoglobin"]
["White Cell Count"]
["Neutrophils"]
["Lymphocytes"]
["Platelets"]
[]
["Actions",1,2,3,4,5,6,7,8]
[1]
[2]
[3]
[4]
[5]
[6]
[7]
[8]