{"text_format":"1","workbook":"xlsx","n_sheets":15,"sheets":["Details","Risk Assessment","Re-Feeding Risk","BP XY","BP XX","Growth XX","Growth XY","BMI XX","BMI XY","LMSDataMale","LMSDataFemale","Daily Sheets","Daily Sheets Extend","Meal Support","Investigations"],"not_rendered":{"charts":10,"images":33,"macros":1,"external_links":3,"defined_names":51,"comments":0,"pivot_tables":0},"unopened":[],"bounds":{"document_bytes":16777216,"sheet_cells":100000,"rows_first":2000,"rows_last":500,"rows_between":2000,"halvings":0,"cell_chars":16384,"cell_head_chars":4096},"cells_cut":0,"cells_raw":0,"read":"whole","date_system":"1900"}

{"sheet":"Details","index":0,"n_rows":46,"n_cols":21,"rows_kept":46,"cut":false,"hidden":false,"merged":[[9,1,9,4],[29,5,30,5],[25,1,25,2],[0,6,0,13],[11,14,14,17],[1,6,3,9],[4,6,6,9],[1,10,3,13],[4,10,6,13],[5,1,5,4],[7,1,7,4],[0,1,0,4],[1,1,1,4],[2,1,2,4],[3,1,3,4],[4,1,4,4],[27,0,27,4],[28,0,28,4],[29,0,29,4],[30,0,30,4],[18,1,18,3],[19,1,19,3],[20,1,20,3],[40,0,40,4],[43,1,43,4],[41,0,41,4],[34,0,34,4],[31,0,31,4],[32,1,32,4],[33,1,33,4],[42,1,42,4]]}
["Patient","Select Sex First",null,null,null,null,null,null,null,null,null,null,null,null,null,null,null,null,1,null,"Anderson"]
["First Name",null,null,null,null,null,null,null,null,null,null,null,null,null,null,null,null,"Yes",2,"inch","Baird"]
["Surname",null,null,null,null,null,null,null,null,null,null,null,null,null,null,null,null,"No",3,"cm","Farnon"]
["Unit No",null,null,null,null,null,null,null,null,null,null,null,null,null,null,null,null,null,4,null,"Gandon"]
["NHS No.",null,null,null,null,null,null,null,null,null,null,null,null,null,null,null,null,null,5,"Male","Gray"]
["Date of Birth",null,null,null,null,null,null,null,null,null,null,null,null,null,null,null,null,null,6,"Female","Kithany"]
[null,null,null,null,null,null,null,null,null,null,null,null,null,null,null,null,null,null,7,null,"Pedley"]
["Birth Sex",null,null,null,null,null,null,null,null,null,null,null,null,null,null,null,null,null,8,null,"Pettit"]
[null,null,null,null,null,null,null,null,null,null,null,null,null,null,null,null,null,null,9,null,"Ridley"]
["Admission Date",{"$f":"NOW()","v":"2022-05-19T13:10:07.600"},null,null,null,null,"Age Lookup","Next Age","Interpolation","Height L","Height M","Height S","Weight L","Weight M","Weight S","BMI L","BMI M","BMI S",10,null,"Staples"]
["Age",{"$f":"IF(B6>0,INT(ROUND(F11,2)),0)","v":0},"Years",{"$f":"IF(B6>0,(F11-B11)*12,0)","v":0},"Months",{"$f":"IF(B10=0,,(B10-B6)/365.2422)","v":122.38604602390981},{"$f":"IF(B8=\"Male\",VLOOKUP((F11),LMSDataMale!A7:M315,1),VLOOKUP((F11),LMSDataFemale!A7:M315,1))","v":23},{"$f":"IF(B8=\"Male\",VLOOKUP((F11+0.084),LMSDataMale!A7:M315,1),VLOOKUP((F11+0.084),LMSDataFemale!A7:M315,1))","v":23},{"$f":"(F11-G11)/(H11-G11)","v":{"$error":"#DIV/0!"}},{"$f":"IF(B8=\"Male\",VLOOKUP(F11,LMSDataMale!A7:M315,2)+I11*((VLOOKUP(H11,LMSDataMale!A7:M315,2))-(VLOOKUP(F11,LMSDataMale!A7:M315,2))),VLOOKUP(F11,LMSDataFemale!A7:M315,2)+I11*((VLOOKUP(H11,LMSDataFemale!A7:M315,2))-(VLOOKUP(F11,LMSDataFemale!A7:M315,2))))","v":{"$error":"#DIV/0!"}},{"$f":"IF(B8=\"Male\",VLOOKUP(F11,LMSDataMale!A7:M315,3)+I11*((VLOOKUP(H11,LMSDataMale!A7:M315,3))-(VLOOKUP(F11,LMSDataMale!A7:M315,3))),VLOOKUP(F11,LMSDataFemale!A7:M315,3)+I11*((VLOOKUP(H11,LMSDataFemale!A7:M315,3))-(VLOOKUP(F11,LMSDataFemale!A7:M315,3))))","v":{"$error":"#DIV/0!"}},{"$f":"IF(B8=\"Male\",VLOOKUP(F11,LMSDataMale!A7:M315,4)+I11*((VLOOKUP(H11,LMSDataMale!A7:M315,4))-(VLOOKUP(F11,LMSDataMale!A7:M315,4))),VLOOKUP(F11,LMSDataFemale!A7:M315,4)+I11*((VLOOKUP(H11,LMSDataFemale!A7:M315,4))-(VLOOKUP(F11,LMSDataFemale!A7:M315,4))))","v":{"$error":"#DIV/0!"}},{"$f":"IF(B8=\"Male\",VLOOKUP(F11,LMSDataMale!A7:M315,5)+I11*((VLOOKUP(H11,LMSDataMale!A7:M315,5))-(VLOOKUP(F11,LMSDataMale!A7:M315,5))),VLOOKUP(F11,LMSDataFemale!A7:M315,5)+I11*((VLOOKUP(H11,LMSDataFemale!A7:M315,5))-(VLOOKUP(F11,LMSDataFemale!A7:M315,5))))","v":{"$error":"#DIV/0!"}},{"$f":"IF(B8=\"Male\",VLOOKUP(F11,LMSDataMale!A7:M315,6)+I11*((VLOOKUP(H11,LMSDataMale!A7:M315,6))-(VLOOKUP(F11,LMSDataMale!A7:M315,6))),VLOOKUP(F11,LMSDataFemale!A7:M315,6)+I11*((VLOOKUP(H11,LMSDataFemale!A7:M315,6))-(VLOOKUP(F11,LMSDataFemale!A7:M315,6))))","v":{"$error":"#DIV/0!"}},{"$f":"IF(B8=\"Male\",VLOOKUP(F11,LMSDataMale!A7:M315,7)+I11*((VLOOKUP(H11,LMSDataMale!A7:M315,7))-(VLOOKUP(F11,LMSDataMale!A7:M315,7))),VLOOKUP(F11,LMSDataFemale!A7:M315,7)+I11*((VLOOKUP(H11,LMSDataFemale!A7:M315,7))-(VLOOKUP(F11,LMSDataFemale!A7:M315,7))))","v":{"$error":"#DIV/0!"}},{"$f":"IF(B8=\"Male\",VLOOKUP(F11,LMSDataMale!A7:M315,8)+I11*((VLOOKUP(H11,LMSDataMale!A7:M315,8))-(VLOOKUP(F11,LMSDataMale!A7:M315,8))),VLOOKUP(F11,LMSDataFemale!A7:M315,8)+I11*((VLOOKUP(H11,LMSDataFemale!A7:M315,8))-(VLOOKUP(F11,LMSDataFemale!A7:M315,8))))","v":{"$error":"#DIV/0!"}},{"$f":"IF(B8=\"Male\",VLOOKUP(F11,LMSDataMale!A7:M315,9)+I11*((VLOOKUP(H11,LMSDataMale!A7:M315,9))-(VLOOKUP(F11,LMSDataMale!A7:M315,9))),VLOOKUP(F11,LMSDataFemale!A7:M315,9)+I11*((VLOOKUP(H11,LMSDataFemale!A7:M315,9))-(VLOOKUP(F11,LMSDataFemale!A7:M315,9))))","v":{"$error":"#DIV/0!"}},{"$f":"IF(B8=\"Male\",VLOOKUP(F11,LMSDataMale!A7:M315,10)+I11*((VLOOKUP(H11,LMSDataMale!A7:M315,10))-(VLOOKUP(F11,LMSDataMale!A7:M315,10))),VLOOKUP(F11,LMSDataFemale!A7:M315,10)+I11*((VLOOKUP(H11,LMSDataFemale!A7:M315,10))-(VLOOKUP(F11,LMSDataFemale!A7:M315,10))))","v":{"$error":"#DIV/0!"}},11,null,"Taylor"]
["Weight",null,"kg",{"$f":"IF(B12=0,,100*NORMSDIST((POWER((B12/N11),M11)-1)/(M11*O11)))","v":0},{"$f":"IF(D12=0,\"\",\"%\")","v":""},null,null,null,null,null,null,null,null,null,null,null,null,null,12]
["Height",null,"cm",{"$f":"IF(B13=0,,100*NORMSDIST(((B13/K11)-1)/L11))","v":0},{"$f":"IF(D13=0,\"\",\"%\")","v":""},null,null,null,null,null,null,null,null,null,null,null,null,null,13]
["BMI",{"$f":"ROUND(IF(B13=0,0,B12/((B13/100)*(B13/100))),2)","v":0},"kg/m2",{"$f":"IF(B14=0,,100*NORMSDIST((POWER(B14/Q11,P11)-1)/(P11*R11)))","v":0},"",null,null,null,null,null,null,null,null,null,null,null,null,null,14]
["%BMI",{"$f":"ROUND(IF(B14=0,,(B12/(B13*B13)*1000000/Q11)),1)","v":0},"% of 50th Percentile BMI",null,null,null,null,null,null,null,null,null,null,null,null,null,null,null,15]
{"$rows_left_out":32}
{"sheet":"Risk Assessment","index":1,"n_rows":35,"n_cols":11,"rows_kept":35,"cut":false,"hidden":false,"merged":[[1,0,1,1],[27,0,28,0],[27,2,28,2],[27,4,28,4],[27,6,28,6],[6,0,9,0],[6,2,9,2],[6,4,9,4],[6,6,9,6],[10,0,11,0],[10,2,11,2],[10,4,11,4],[10,6,11,6],[7,3,9,3],[7,1,9,1],[1,4,1,5],[30,0,31,0],[30,2,31,2],[30,4,31,4],[30,6,31,6],[16,0,18,0],[16,2,18,2],[16,4,18,4],[16,6,18,6],[19,0,26,0],[19,2,26,2],[19,4,26,4],[19,6,26,6],[16,5,18,5],[6,9,9,9],[6,10,9,10],[10,8,11,8],[10,9,11,9],[10,10,11,10],[30,9,31,9],[30,10,31,10],[16,8,18,8],[16,9,18,9],[16,10,18,10],[19,8,26,8],[27,8,28,8],[19,9,26,9],[19,10,26,10],[27,9,28,9],[27,10,28,10],[2,2,3,2],[2,4,3,4],[2,6,3,6],[30,8,31,8],[6,8,9,8]]}
["Risk Assessment"]
[{"$f":"Details!B2&\" \"&Details!B3","v":" "},null,null,{"$f":"\"Date of Birth   \"","v":"Date of Birth   "},{"$f":"Details!B6","v":"00:00:00"}]
[null,"Red",{"$f":"I4&\" of 16\"","v":"0 of 16"},"Amber",{"$f":"J4& \" of 13\"","v":"0 of 13"},"Green",{"$f":"K4&\" of 11\"","v":"0 of 11"},null,"Red","Amber","Green"]
[null,"High Risk",null,"Alert to High Concern",null,"Low Risk",null,"Clear",{"$f":"COUNTIF(I5:I35,TRUE)","v":0},{"$f":"COUNTIF(J5:J35,TRUE)","v":0},0]
["BMI","%BMI <70",null,"%BMI 70–80%",null,"%BMI>80%",null,null,{"$f":"IF(Details!B15<70,IF(Details!B15=0,FALSE,TRUE),FALSE)","v":false},{"$f":"IF(AND(Details!B15>=70,Details!B15<=80),TRUE,FALSE)","v":false},false]
["Weight Loss","Recent loss of weight of 1 kg or more/week for 2 consecutive weeks in an undernourished patient",null,"Recent loss of weight of 500– 999 g/week for 2 consecutive weeks in an undernourished patient",null,"Recent weight loss of < 500 g/week or fluctuating weight",null,null,false,false,false]
["Heart Rate","40 bpm",null,"40–50 bpm",null,">50 bpm",null,null,false,false,false]
[null,"Standing BP below 0.4th centile for age or less than 90 if 18+, associated with recurrent syncope and postural drop in BP of >20 mm Hg or increase in HR of over 30 bpm (35 bpm in <16 years)",null,"Standing BP <0.4th centile or <90 if 18+ associated with occasional syncope; postural drop in BP of >15 mm Hg or increase in HR of up to 30 bpm (35 bpm in <16 years)",null,"Normal standing BP for age and gender with reference to centile charts"]
[null,null,null,null,null,"Normal orthostatic cardiovascular changes"]
[null,null,null,null,null,"Normal heart rhythm"]
["Hydration status","Fluid refusal",null,"Severe fluid restriction",null,"Minimal Fluid Restriction",null,null,false,false,false]
[null,"Severe dehydration (10%): reduced urine output, dry mouth, postural BP drop (see above), decreased skin turgor, sunken eyes, tachypnoea, tachycardia",null,"Moderate dehydration (5–10%): reduced urine output, dry mouth, postural BP drop (see above), normal skin turgor, some tachypnoea, some tachycardia, peripheral oedema",null,"No more than mild dehydration (<5%): may have dry mouth or concerns about risk of dehydration with negative fluid balance"]
["Temperature","<35.5°C tympanic or 35.0°C axillary",null,"<36°C",null,">36°C",null,null,false,false,false]
["Muscular weakness – SUSS Test, Part 1: Sit up from lying flat","Unable to sit up at all from lying flat or Unable to sit up without using upper limbs (score 0 or 1)",null,"Unable to sit up without noticeable difficulty (score 2)",null,"Sits up from lying flat without any difficulty (score 3)",null,null,false,false,false]
["Muscular weakness – SUSS Test, Part 2: Stand up from squat","Unable to get up at all from squatting or Unable to get up without using upper limbs (score 0 or 1)",null,"Unable to get up without noticeable difficulty (score 2)",null,"Stands up from squat without any difficulty (score 3)",null,null,false,false,false]
{"$rows_left_out":21}
{"sheet":"Re-Feeding Risk","index":2,"n_rows":23,"n_cols":5,"rows_kept":23,"cut":false,"hidden":false,"merged":[[4,0,4,3],[9,0,9,3],[1,0,1,3],[2,1,2,3],[3,0,3,3]]}
["Re-feeding Risk"]
[{"$f":"Details!B2&\" \"&Details!B3","v":" "}]
[{"$f":"\"Date of Birth   \"","v":"Date of Birth   "},{"$f":"Details!B6","v":"00:00:00"}]
["Assessment of risk of re-feeding syndrome "]
["Refeeding syndrome can be defined as the potentially fatal shifts in fluids and electrolytes that may occur in malnourished patients on refeeding following a period of starvation. This is particularly common in adult patients receiving artificial refeeding, but is possible with oral refeeding (particularly if oral nutritional supplements are prescribed). The adult patient should be considered at risk of refeeding syndrome if they meet the following criteria.",null,null,null,"Yes"]
[null,null,null,null,"No"]
[null,null,null,null,"--"]
[]
[]
["In children there are no universally accepted criteria, but the there is increasing concern if there is acute on chronic weight loss. "]
[]
[]
["Clinical Feature","select",null,"High Risk Level"]
["Extremely low weight",{"$f":"IF('Risk Assessment'!I5=TRUE,\"Yes\",\"No\")","v":"No"},null,"%BMI <70%"]
["Prolonged low intake","--",null,"Little or no intake for >4 days"]
{"$rows_left_out":9}
{"sheet":"BP XY","index":3,"n_rows":1,"n_cols":28,"rows_kept":1,"cut":false,"hidden":true,"merged":[[0,15,0,21]]}
[null,{"$f":"Details!B2&\" \"&Details!B3","v":" "},null,null,null,null,null,null,null,null,null,null,null,null,{"$f":"\"Date of Birth \"","v":"Date of Birth "},{"$f":"Details!B6","v":"00:00:00"},null,null,null,null,null,null,null,null,null,null,null,{"$f":"\"No. \"&Details!B4","v":"No. "}]

{"sheet":"BP XX","index":4,"n_rows":1,"n_cols":28,"rows_kept":1,"cut":false,"hidden":true,"merged":[[0,15,0,21]]}
[null,{"$f":"Details!B2&\" \"&Details!B3","v":" "},null,null,null,null,null,null,null,null,null,null,null,null,{"$f":"\"Date of Birth \"","v":"Date of Birth "},{"$f":"Details!B6","v":"00:00:00"},null,null,null,null,null,null,null,null,null,null,null,{"$f":"\"No. \"&Details!B4","v":"No. "}]

{"sheet":"Growth XX","index":5,"n_rows":1,"n_cols":28,"rows_kept":1,"cut":false,"hidden":true,"merged":[[0,15,0,21]]}
[null,{"$f":"Details!B2&\" \"&Details!B3","v":" "},null,null,null,null,null,null,null,null,null,null,null,null,{"$f":"\"Date of Birth \"","v":"Date of Birth "},{"$f":"Details!B6","v":"00:00:00"},null,null,null,null,null,null,null,null,null,null,null,{"$f":"\"No. \"&Details!B4","v":"No. "}]

{"sheet":"Growth XY","index":6,"n_rows":1,"n_cols":28,"rows_kept":1,"cut":false,"hidden":true,"merged":[[0,15,0,21]]}
[null,{"$f":"Details!B2&\" \"&Details!B3","v":" "},null,null,null,null,null,null,null,null,null,null,null,null,{"$f":"\"Date of Birth \"","v":"Date of Birth "},{"$f":"Details!B6","v":"00:00:00"},null,null,null,null,null,null,null,null,null,null,null,{"$f":"\"No. \"&Details!B4","v":"No. "}]

{"sheet":"BMI XX","index":7,"n_rows":1,"n_cols":28,"rows_kept":1,"cut":false,"hidden":true,"merged":[[0,15,0,21]]}
[null,{"$f":"Details!B2&\" \"&Details!B3","v":" "},null,null,null,null,null,null,null,null,null,null,null,null,{"$f":"\"Date of Birth \"","v":"Date of Birth "},{"$f":"Details!B6","v":"00:00:00"},null,null,null,null,null,null,null,null,null,null,null,{"$f":"\"No. \"&Details!B4","v":"No. "}]

{"sheet":"BMI XY","index":8,"n_rows":1,"n_cols":28,"rows_kept":1,"cut":false,"hidden":true,"merged":[[0,15,0,21]]}
[null,{"$f":"Details!B2&\" \"&Details!B3","v":" "},null,null,null,null,null,null,null,null,null,null,null,null,{"$f":"\"Date of Birth \"","v":"Date of Birth "},{"$f":"Details!B6","v":"00:00:00"},null,null,null,null,null,null,null,null,null,null,null,{"$f":"\"No. \"&Details!B4","v":"No. "}]

{"sheet":"LMSDataMale","index":9,"n_rows":315,"n_cols":13,"rows_kept":315,"cut":false,"hidden":true,"merged":[]}
["Male"]
[]
[]
[null,"Height (HT, cm)",null,null,"Weight (WT, kg)",null,null,"BMI (BMI, kg/m2)",null,null,"Head Circumference (cm)"]
["Age (yrs)"]
[null,"L","M","S","L","M","S","L","M","S","L","M","S"]
[-0.32580424366872007,null,null,null,1.147,0.61450000000000005,0.15875,null,null,null,1,21.632670000000001,4.4657460000000003E-2]
[-0.30663928815879532,null,null,null,1.1259999999999999,0.71420000000000006,0.16249,null,null,null,1,22.664660000000001,4.660628E-2]
[-0.28747433264887062,1,35.424140000000001,8.1324530000000006E-2,1.1040000000000001,0.81670000000000009,0.16628000000000001,null,null,null,1,23.69877,4.8520649999999999E-2]
[-0.26830937713894593,1,36.42492,7.8620040000000002E-2,1.083,0.9244,0.17007,null,null,null,1,24.733899999999998,5.0329029999999997E-2]
[-0.24914442162902123,1,37.427720000000001,7.5907249999999996E-2,1.0609999999999999,1.0364,0.17355000000000001,null,null,null,1,25.758299999999998,5.1834610000000003E-2]
[-0.2299794661190965,1,38.427889999999998,7.3144319999999999E-2,1.04,1.1577,0.17663000000000001,null,null,null,1,26.73601,5.2778360000000003E-2]
[-0.21081451060917181,1,39.436729999999997,7.0259660000000002E-2,1.018,1.2898000000000001,0.17904999999999999,null,null,null,1,27.63749,5.3023889999999997E-2]
[-0.19164955509924708,1,40.480080000000001,6.7222379999999998E-2,0.997,1.4359999999999999,0.18056,null,null,null,1,28.480129999999999,5.2590970000000001E-2]
[-0.17248459958932238,1,41.578380000000003,6.4044069999999995E-2,0.97499999999999998,1.605,0.18092,null,null,null,1,29.283850000000001,5.1560450000000001E-2]
{"$rows_left_out":301}
{"sheet":"LMSDataFemale","index":10,"n_rows":315,"n_cols":13,"rows_kept":315,"cut":false,"hidden":true,"merged":[]}
["Female"]
[]
[]
[null,"Height (HT, cm)",null,null,"Weight (WT, kg)",null,null,"BMI (BMI, kg/m2)",null,null,"OFC"]
["Age"]
["(years)","L","M","S","L","M","S","L","M","S","L","M","S"]
[-0.32580424366872007,null,null,null,1.3260000000000001,0.55889999999999995,0.17377999999999999,null,null,null,1,21.101559999999999,6.6295300000000001E-2]
[-0.30663928815879532,null,null,null,1.278,0.65839999999999999,0.17716000000000001,null,null,null,1,22.168089999999999,6.4821619999999996E-2]
[-0.28747433264887062,1,34.595440000000004,8.0860440000000006E-2,1.2290000000000001,0.7611,0.18065999999999999,null,null,null,1,23.23329,6.3313949999999994E-2]
[-0.26830937713894593,1,35.597709999999999,7.735533E-2,1.181,0.86720000000000008,0.18429000000000001,null,null,null,1,24.290140000000001,6.1736390000000002E-2]
[-0.24914442162902123,1,36.609050000000003,7.3865970000000003E-2,1.1319999999999999,0.97750000000000004,0.18779000000000001,null,null,null,1,25.32564,6.0077279999999997E-2]
[-0.2299794661190965,1,37.658320000000003,7.0423669999999994E-2,1.0840000000000001,1.0929,0.19058,null,null,null,1,26.316020000000002,5.8353889999999999E-2]
[-0.21081451060917181,1,38.769869999999997,6.7018910000000001E-2,1.0349999999999999,1.2165999999999999,0.19209000000000001,null,null,null,1,27.25686,5.6500729999999999E-2]
[-0.19164955509924708,1,39.94117,6.3626740000000001E-2,0.98699999999999999,1.3593,0.19212000000000001,null,null,null,1,28.15286,5.4430449999999998E-2]
[-0.17248459958932238,1,41.141539999999999,6.0254309999999998E-2,0.93799999999999994,1.5249999999999999,0.19051999999999999,null,null,null,1,29.009239999999998,5.2120060000000003E-2]
{"$rows_left_out":301}
{"sheet":"Daily Sheets","index":11,"n_rows":87,"n_cols":11,"rows_kept":87,"cut":false,"hidden":true,"merged":[[1,5,1,6],[1,7,1,9],[1,10,11,10],[2,5,2,6],[2,7,2,9],[3,5,3,6],[3,7,3,9],[4,5,4,6],[4,7,4,9],[57,5,57,6],[57,7,57,9],[6,2,6,4],[54,5,54,6],[54,7,54,9],[55,5,55,6],[55,7,55,9],[56,5,56,6],[56,7,56,9],[58,8,58,10],[65,1,65,2],[66,1,66,2],[62,1,62,2],[63,1,63,2],[61,1,61,2]]}
[]
[null,null,null,null,null,"Name",null,{"$f":"Details!B2&\" \"&Details!B3","v":" "},null,null,{"$f":"C7","v":"2022-05-20T13:10:07.600"}]
[null,null,null,null,null,"Date of Birth",null,{"$f":"Details!B6","v":"00:00:00"}]
[null,null,null,null,null,"Unit Number",null,{"$f":"Details!B4","v":0}]
[null,null,null,null,null,"NHS Number",null,{"$f":"Details!B5","v":0}]
[]
[null,"Date",{"$f":"Details!B10+D8","v":"2022-05-20T13:10:07.600"}]
[null,"Admission Day",null,1,null," (Day of admission = Day 0)"]
[]
[null,{"$f":"IF(D8=1,\"Admission Weight= \"&Details!B12&\" kg, Height= \"&Details!B13&\" cm   BMI= \"&Details!B14&\" kg/m2   (%BMI= \"&Details!B15&\" )\",IF(OR(WEEKDAY(C7)=2,WEEKDAY(C7)=5), \"Weight Today before Breakfast-            Weight__________ kg\", \"Last Weight__________ kg\"))","v":"Admission Weight=  kg, Height=  cm   BMI= 0 kg/m2   (%BMI= 0 )"}]
[]
[null,"Joint Medical & Nursing Ward Round"]
[null,null,{"$f":"IF(Details!B24=\"Yes\",IF(D8<6,\"Re-Feeding Risk-->  Day \"&D8,\"Re-feeding Risk ?     Yes / No\"),\"Re-feeding Risk ?     Yes / No\")","v":"Re-Feeding Risk-->  Day 1"}]
[null,null,"Compliance with Diet"]
[null,null,null,"Meal Plan Number  _______ "]
{"$rows_left_out":73}
{"sheet":"Daily Sheets Extend","index":12,"n_rows":87,"n_cols":11,"rows_kept":87,"cut":false,"hidden":true,"merged":[[56,5,56,6],[56,7,56,9],[1,5,1,6],[1,7,1,9],[1,10,11,10],[2,5,2,6],[2,7,2,9],[3,5,3,6],[3,7,3,9],[4,5,4,6],[4,7,4,9],[6,2,6,4],[54,5,54,6],[54,7,54,9],[55,5,55,6],[55,7,55,9],[65,1,65,2],[66,1,66,2],[57,5,57,6],[57,7,57,9],[58,8,58,10],[61,1,61,2],[62,1,62,2],[63,1,63,2]]}
[]
[null,null,null,null,null,"Name",null,{"$f":"Details!B2&\" \"&Details!B3","v":" "},null,null,{"$f":"C7","v":"2022-05-20T13:10:07.600"}]
[null,null,null,null,null,"Date of Birth",null,{"$f":"Details!B6","v":"00:00:00"}]
[null,null,null,null,null,"Unit Number",null,{"$f":"Details!B4","v":0}]
[null,null,null,null,null,"NHS Number",null,{"$f":"Details!B5","v":0}]
[]
[null,"Date",{"$f":"Details!B43+D8","v":"2022-05-20T13:10:07.600"}]
[null,"Admission Day",null,{"$f":"Details!B45","v":1},null," (Day of admission = Day 0)"]
[]
[null,{"$f":"IF(OR(WEEKDAY(C7)=2,WEEKDAY(C7)=5), \"Weight Today before Breakfast-            Weight__________ kg\", \"Last Weight__________ kg\")","v":"Last Weight__________ kg"}]
[]
[null,"Joint Medical & Nursing Ward Round"]
[null,null,{"$f":"IF(Details!B24=\"Yes\",IF(D8<6,\"Re-Feeding Risk-->  Day \"&D8,\"Re-feeding Risk ?     Yes / No\"),\"Re-feeding Risk ?     Yes / No\")","v":"Re-Feeding Risk-->  Day 1"}]
[null,null,"Compliance with Diet"]
[null,null,null,"Meal Plan Number  _______ "]
{"$rows_left_out":73}
{"sheet":"Meal Support","index":13,"n_rows":13,"n_cols":2,"rows_kept":13,"cut":false,"hidden":true,"merged":[[11,1,11,5],[12,1,12,5],[4,1,4,4],[5,1,5,4],[6,1,6,5],[7,1,7,5],[8,1,8,5],[9,1,9,5],[0,0,0,5],[1,1,1,5],[2,1,2,5],[3,1,3,5],[10,1,10,5]]}
["Meal Time Support"]
["n","Try to remember eating is normal, we all do it! "]
["n","Food is Fuel and our bodies need regular fuel to survive, like a car would brakdown if it ran out of petrol. You don't have to love or like your food (it helps), but you do need to eat to survive."]
["n","Distractions can be a big help for managing anxiety before, during and after a meal. Think about what distractions might be helpful for you. Some examples of things other young people have found helpful include: a place mat with motivational words or goals on, playing a game with the family, have a puzzle to do like Sudoku, reading and watching your favourite TV show or movie."]
["n","You might want to look at this animation of an A-Z list of coping strategies; https://www.youtube.com/watch?v=5EXpkVw3fh0&feature=youtu.be"]
["n","To help manage any negative emotions you might want to make a ‘self-soothe’ or ‘coping box’. This is a place where you store any items that bring you comfort, it might include things that are soothing to the senses like smelly candles or bubble wrap to pop, it might have some distraction toys in like fidget spinners or stress balls or it might be something that makes you smile or feel better like a letter from a loved one, pictures or a memory. Take a look at this animation which tells you more about coping boxes: https://www.youtube.com/watch?v=OyfgodSSdV4&feature=youtu.be "]
["n","At the table it might be helpful to have non-problem focused talk (e.g., what happened that day) - have some cards with topics on to save having to think about it when everyone is stressed or worried."]
["n","Each person is individual on the environments they find most calming. Have a think about what some of your preferences are e.g. do you like having music/ radio/ TV/ chatting in the background or a quiet space (some people like some background noise some don’t)."]
["n","Have anyone that helps nearby (in person or on the phone)"]
["n","Have a chilled activity planned for afterwards (see distraction list)- away from kitchen."]
["n","If you’re going out to eat, check menus before- have option A and B in mind in case option A not available"]
["n","If you’re going out sit somewhere quieter if that helps; perhaps book a table in advance"]
["n","Remember that your parents are only trying to help. If they say or do something that you find unhelpful, let them know and if there is something they can do or say that is more helpful."]

{"sheet":"Investigations","index":14,"n_rows":36,"n_cols":9,"rows_kept":36,"cut":false,"hidden":true,"merged":[[33,1,33,8],[34,1,34,8],[35,1,35,8],[0,6,0,8],[0,0,0,3],[26,0,26,8],[28,1,28,8],[29,1,29,8],[30,1,30,8],[31,1,31,8],[32,1,32,8]]}
[{"$f":"Details!B2&\" \"&Details!B3","v":" "},null,null,null,null,{"$f":"\"Date of Birth   \"","v":"Date of Birth   "},{"$f":"Details!B6","v":"00:00:00"}]
["Day",{"$f":"Details!B10","v":"2022-05-19T13:10:07.600"},{"$f":"IF(Details!$B$24=\"Yes\",B$2+1,\"\")","v":"2022-05-20T13:10:07.600"},{"$f":"IF(Details!$B$24=\"Yes\",C$2+1,\"\")","v":"2022-05-21T13:10:07.600"},{"$f":"IF(Details!$B$24=\"Yes\",D$2+1,\"\")","v":"2022-05-22T13:10:07.600"},{"$f":"IF(Details!$B$24=\"Yes\",E$2+1,\"\")","v":"2022-05-23T13:10:07.600"},{"$f":"IF(Details!$B$24=\"Yes\",F$2+1,\"\")","v":"2022-05-24T13:10:07.600"}]
["Time"]
["Day",0,{"$f":"IF(Details!$B$24=\"Yes\",B$4+1,\"\")","v":1},{"$f":"IF(Details!$B$24=\"Yes\",C$4+1,\"\")","v":2},{"$f":"IF(Details!$B$24=\"Yes\",D$4+1,\"\")","v":3},{"$f":"IF(Details!$B$24=\"Yes\",E$4+1,\"\")","v":4},{"$f":"IF(Details!$B$24=\"Yes\",F$4+1,\"\")","v":5}]
["Sodium"]
["Potassium"]
["Urea"]
["Creatinine"]
["Albumin"]
["Magnesium"]
["Phosphate"]
["Bilirubin"]
["Total  Protein"]
["ALT"]
["Alk Phos"]
{"$rows_left_out":21}